{"text_format":"1","workbook":"xlsx","n_sheets":30,"sheets":["_Menu","_Setup","_Reports","_Plot","_Me","_Team","Med_Suppl","_Ins","_Questions","_Checklist","Allergy_log","_Foods","_Diary","_Overview","_Performance","_Glossary","_CBC","_1","_2","_3","_4","_5","_6","_7","_8","_9","_10","_11","_12","Measures"],"not_rendered":{"charts":2,"images":0,"macros":1,"external_links":0,"defined_names":339,"comments":0,"pivot_tables":0},"unopened":[],"bounds":{"document_bytes":16777216,"sheet_cells":100000,"rows_first":2000,"rows_last":500,"rows_between":2000,"halvings":0,"cell_chars":16384,"cell_head_chars":4096},"cells_cut":0,"cells_raw":0,"read":"whole","date_system":"1900"}

{"sheet":"_Menu","index":0,"n_rows":18,"n_cols":9,"rows_kept":18,"cut":false,"hidden":false,"merged":[[8,1,9,1],[10,1,11,1],[1,1,1,5],[6,1,7,1],[6,5,7,5],[6,4,7,4],[6,3,7,3],[6,2,7,2],[8,2,9,2],[8,3,9,3],[8,4,9,4],[8,5,9,5],[10,5,11,5],[10,4,11,4],[10,3,11,3],[10,2,11,2]]}
[null,"<= dark blue when worksheet is protected","MyLabs",null,"Version:","2017-09-05","abc123"]
[null,null,null,null,null,null,null,null,"JS"]
[]
[null,"My Record","Medical\nTeam","Insurance Provider / Log",null,"My Labs\nIntroduction"]
[null,"My Journal","Questions","Checklist"]
[null,"Medications and Supplements","Allergy\nLog","Food List for\nImmune Suppressed"]
[null,"Lab SETUP \n\n(start here)","Lab 1","Lab 2","Lab 3","Lab 4"]
[]
[null,"Lab Report","Lab 5","Lab 6","Lab 7","Lab 8"]
[]
[null,"Lab Plots","Lab 9","Lab 10","Lab 11","Lab 12"]
[]
[]
[null,"CBC Reference Range "]
[]
[null,"Measures"]
[]
[null,"Performance Scales"]

{"sheet":"_Setup","index":1,"n_rows":55,"n_cols":8,"rows_kept":55,"cut":false,"hidden":false,"merged":[[4,2,4,5],[3,2,3,5],[58,1,58,3],[55,1,55,3],[56,1,56,3],[57,1,57,3]]}
[null,null,"Lab 1","Lab 2","Lab 3","Lab 4"]
[null,null,"Lab 5","Lab 6","Lab 7","Lab 8"]
["Lab Setup","Lab Setup","Lab 9","Lab 10","Lab 11","Lab 12"]
["Lab Plot","(start here)"]
["Lab Report"]
["Measures",null,null,null,null,null,"Reference Ranges & What They Mean - LabTestsOnline"]
["Type","Test Name","Units","Low","High","Organ or System","Indications & Notes","Web Link"]
["Complete Metabolic Profile","ALP (Alkaline Phosphatase)","IU/L",30,130,null,"Tissues with high concentrations of ALP (an enzyme) include the liver, bile ducts, placenta, and bone. Damaged or diseased tissue releases enzymes into the blood, so serum ALP measurements can be abnormal in many conditions. Serum ALP is also increased in some normal circumstances (for example, during normal bone growth) or in response to a variety of drugs. Adapted from MedlinePlus 2004","MedlPlus"]
[" ","ALT (amino alanine transferase)","IU/L",5,40,"Liver","Formerly SGPT. An enzyme involved in the metabolism of the amino acid alanine. Used to determine if a patient has liver damage. ALT is  in a number of tissues but is in highest concentrations in the liver. Injury to the liver results in release of the enzyme into the blood. Adapted from MedlinePlus 2004 ","MedlPlus"]
[" ","AST (aspartate aminotransferase)","IU/L",10,45,"Liver","Formerly SGOT. AST is in high concentration in heart muscle, liver cells, skeletal muscle cells, and to a lesser degree, in other tissues. Although elevated serum AST is not specific for liver disease, it is used primarily to diagnose and monitor the course of liver disease (in combination with other enzymes such as ALT, ALP, and bilirubin) Adapted from MedlPlus 2004","MedlPlus"]
[" ","Albumin, serum (Alb)","gm/dL ",3.5,5,"Protein","Most prevalent protein of the blood plasma. Synthesized by the liver. Decreased levels may result from liver disease; or from kidney disease, which allows albumin to escape into the urine. Decreased albumin may also be explained by malnutrition or a low protein diet. Low levels may indicate ascites. Adapted from MedlnePlus 2004.","MedlPlus"]
[" ","Bilirubin, Total (Bili), serum","mg/dL",0.2,1,"Liver","High bilirubin may mean that too many red cells are being destroyed, or that the liver is incapable of removing bilirubin from the blood. Total serum bilirubin equals direct bilirubin plus indirect bilirubin.  ","MedlPlus"]
[" ","BUN (Blood urea nitrogen)","mg/dL",8,18,"Kidney","As part of a basic metabolic panel or if you have non-specific symptoms that may indicate a kidney problem ","MedlPlus"]
[" ","Ca - Calcium","mg/dL",8.5,10.5,"Cellular processes","Calcium (Ca) is required for the proper functioning of numerous intracellular and extracellular processes, including muscle contraction, nerve conduction, hormone release, and blood coagulation. In addition, the Ca ion plays a unique role in intracellular signaling and is involved in the regulation of many enzymes. The maintenance of Ca homeostasis, therefore, is critical ~ Merk Manual","MedlPlus"]
[" ","CI - Chloride","mEq/L",97,107,"Electrolyte","A blood chloride test is usually ordered as part of an electrolyte panel or a basic metabolic panel. It is also helpful in persons with too much base (alkalosis) to help determine the cause."]
[" ","CO2 - Carbon dioxide","mEq/L",20,29,"Electrolyte","Also called: 'Bicarbonate test; HCO3- The CO2 levels in the blood are influenced by kidney and respiratory (lung) function.  Almost always done as part of an electrolyte panel. Adapted from MedlinePlus / LabTestsonline","MedlPlus"]
[" ","CRT - Creatinine","mg/dL",0.6,1.5,"Kidney","Performed to evaluate kidney function. If kidney function is abnormal, creatinine levels will increase in the blood, due to decreased excretion of creatinine in the urine. Levels also vary according to a persons size and muscle mass.  0.8 to 1.4 mg/dl.","MedlPlus"]
[" ","Glucose","mg/dL",65,110,"Metabolism","High levels indicate diabetes mellitus, Type II diabetes mellitus. Low indicates hypoglycemia.","MedlPlus"]
[" ","Mg - Magnesium","mg/dL",1.8,2.5,"Electrolyte","May be ordered as a follow-up to chronically low levels of calcium and potassium. It also may be ordered if you have symptoms of an abnormally low magnesium level such as muscle weakness, twitching, cramping, confusion, cardiac arrhythmias, and seizures. Adapted from LabTestsonline\n","Ltonline"]
[" ","Potassium (K)","mEq/L",3.5,5,"Electrolyte","As part of a routine medical exam or to investigate a serious illness, such as high blood pressure or kidney disease","LTonline"]
[" ","Sodium (Na)","mEq/L",135,145,"Electrolyte","Tested to monitor hydration, edema, problems with blood pressure, or have non-specific symptoms; often part of routine laboratory evaluations; also to monitor certain chronic conditions, like high or low blood pressure ","LTonline"]
[" ","Total Protein","gm/dL ",6,8,"Protein","To determine your nutritional status or to screen for certain liver and kidney disorders as well as other diseases. Descreasing levels associated with lymphoma progression.","LTonline"]
["CBC","RBC - Red Blood Cells","(X106/uL)",4.4000000000000004,5.6,"Blood cell","(Erythrocytes) Gender- and age-specific reference range. Low levels cause anemia and fatigue.","MedlPlus"]
[" ","Hgb - Hemoglobin","(g/dL)",13,18,"Blood cell component","Red blood pigment. Gender- and age-specific reference range.  Deficiency of iron and therefore of hemoglobin leads to anemia and decreased ability to carry oxygen to body tissues"]
[" ","Hct - Hematocrtit","%",0.38,0.5,"Blood cell proportion","Gender- and age-specific reference range. Percent of whole blood that is comprised of red blood cells; measure of both the number and  size of red blood cells."]
[" ","MCV - Mean Corp. Volume","(fL)",81,98,"Blood cell size","Measures the size of red blood cells. Larger or smaller than normal red blood cells may indicate anemia."]
[" ","MCH - Mean Corp. Hgb","(pg)",27.3,33.6,"Blood cell component","Estimate of the amount of hemoglobin in the average red cell. Low levels indicate anemia."]
[" ","MCHC - Mean Corp. Hgb Concentration","(g/dL)",32.299999999999997,35.700000000000003,"Blood cell component","Estimate of the amount of hemoglobin in the average red cell. Low levels indicate anemia. 32.3 - 35.7"]
[" ","RDW - Red cell Dist Width","%",0.11799999999999999,0.14099999999999999,"Blood cell variability","Red blood cells can come in different sizes. Measures size variability of Red Blood Cell population "]
[" ","ESR - Erythrocyte Sedimentation Rate","mm/hr",0.01,20,"  ","Used to monitor inflammatory or malignant disease, rheumatic fever, and heart attack. This test is not considered diagnostic for any particular disorder. Useful in detecting and monitoring tuberculosis, tissue necrosis (death), rheumatologic disorders, or an otherwise unsuspected disease in which symptoms are vague. ~ Adapted from MedlinePlus ","MedlPlus"]
[" ","Platelets (Thrombocytes)","(X103/uL)",150,400,"Blood cell","Help your to blood clot in order to stop bleeding from injury. Decreased platelet count is called thrombocytopenia. (Age-specific reference range.)","MedlPlus"]
[" ","WBC - White blood cells","(X103/uL)",4.3,10,"Blood cell","(Leukocytes) Low levels associated with risk of infection; high levels indicates possible infection.  (Gender- and age-specific reference range.)"]
[" ","Basophils","(X103/uL)",0.01,0.2,"Blood cell","Control inflammation and damage of tissues in the body."]
[" ","Eosinophils","(X103/uL)",0.01,0.5,"Blood cell","A  type of phagocyte that produces the anti-inflammatory protein histamine."]
[" ","Monocytes","(X103/uL)",0.01,0.8,"Blood cell","Germ eating cells. A low number can increase risk of getting sick from an infection, particularly of bacteria type. "]
["Differential","Total Neutrophils","%",38,80,"Blood cell","The percentage is often increased during a bacterial infection; a low number can put you at a greater risk of experiencing sickness from a bacterial infection. "]
[" ","Total Neutrophils, Absolute (ANC)","Cells/Cu.Mm",1650,8000,"Blood cell count","Multiplying the percentage of neutrophils by the total number of white blood cells will give the \"absolute\" number of these types of cells. Polys are mature neutrophils;bands are young polys, which also fight infections."]
[" ","Total Lymphocytes","%",15,49,"Blood cell","Lymphocytes, which include T-cells, B-cells, and natural killer (NK) cells, should account for between 15% and 49% of the total white blood cell count."]
[" ","Total Lymphocytes, Absolute","Cells/Cu.Mm",1000,3500,"Blood cell"," Multiplying the percentage of lymphocytes by the total number of white blood cells will give the \"absolute\" number of these types of cells."]
[" ","Monocytes","%",0.01,13,"Blood cell","Monocytes are a type of phagocyte. These mature into macrophages, important germ eating cells. A low number can put you at a higher risk of getting sick from an infection, particularly those caused by bacteria. "]
[" ","Monocytes, Absolute ","Cells/Cu.Mm",40,900,"Blood cell","Multiplying the percentage of monocytes by the total number of white blood cells will give the \"absolute\" number of these types of cells."]
[" ","Basophils","%",0.01,2,"Blood cell","Responsible for controlling inflammation and damage of tissues in the body, such as liver inflammation due to hepatitis. "]
[" ","Basophils, Absolute","Cells/Cu.Mm",0.01,125,"Blood cell","Multiplying the percentage of basophils by the total number of white blood cells will give the \"absolute\" number of these types of cells."]
[" ","Eosinophils","%",0.01,8,"Blood cell","A high number of eosonophils, a type of phagocyte that produces the anti-inflammatory protein histamine, can be seen in people with allergies or parasitic infections. "]
[" ","Eosinophils, Absolute","Cells/Cu.Mm",30,600,"Blood cell","Multiplying the percentage of eosinophils by the total number of white blood cells will give the \"absolute\" number of these types of cells."]
["Lipids","Cholesterol, total","mg/dL",130,200,"Lipid","In most cases, the higher your total cholesterol, the higher your risk for heart disease. Unexplained decreasing levels are assoicated with lymphoma progression. Adapted from MedlinePlus","MedlPlus"]
[" ","Triglycerides","mg/dL",10,150,"Lipid","Usually part of a lipid profile used to identify the risk of developing heart disease. If you are diabetic, it is especially important to have triglycerides measured as part of any lipid testing since triglycerides increase significantly when blood sugar is out of control.","MedlPlus"]
["Markers","Lactate dehydrogenase (LDH)"," u/l ",100,190,"Enzyme","Dividing lymphocytes produce more of this enzyme","MedlPlus"]
[" ","Beta-2 Microglobulin (B2M)","g/ml",0.01,2.5]
[" ","Uric acid","mg/dL",2.5,8,"Blood?","The end product of purine metabolism. Purines are building blocks of RNA and DNA. Most uric acid produced in the body is excreted by the kidneys. An overproduction of uric acid occurs when there is excessive breakdown of cells, which contain purines, or an inability of the kidneys to excrete uric acid.","MedlPlus"]
["Custom","Urine Albumin /  Albumin/Creatinine Ratio"]
[" ","eGFR","mL/min/1.73m",60,100]
[" ","cystatin C "]
[" ","Custom 4"]
[" ","Custom 5"]

{"sheet":"_Reports","index":2,"n_rows":53,"n_cols":22,"rows_kept":53,"cut":false,"hidden":false,"merged":[]}
[null,null,null,null,null,null,null,null,null,null,null,null,null,null,null,null,null,null,"Lab 1","Lab 2","Lab 3","Lab 4"]
[null,"Lab Setup",null,null,null,"Read Only: the names and values shown here are calculated from Labs 1-12 and Setup",null,null,null,null,null,null,null,null,null,null,null,null,"Lab 5","Lab 6","Lab 7","Lab 8"]
[null,"Lab Report",null,null,null,null,null,null,null,null,null,null,null,null,null,null,null,null,"Lab 9","Lab 10","Lab 11","Lab 12"]
[null,"Lab Plot","Lab 1","Lab 2","Lab 3","Lab 4","Lab 5","Lab 6","Lab 7","Lab 8","Lab 9","Lab 10","Lab 11","Lab 12"]
["Charts","Lab Report - Dates:   ",{"$f":"_1!B2","v":"2017-01-01"},{"$f":"_2!B2","v":"00:00:00"},{"$f":"_3!B2","v":"00:00:00"},{"$f":"_4!B2","v":"00:00:00"},{"$f":"_5!B2","v":"00:00:00"},{"$f":"_6!B2","v":"00:00:00"},{"$f":"_7!B2","v":"00:00:00"},{"$f":"_8!B2","v":"00:00:00"},{"$f":"_9!B2","v":"00:00:00"},{"$f":"_10!B2","v":"00:00:00"},{"$f":"_11!B2","v":"00:00:00"},{"$f":"_12!B2","v":"00:00:00"},"Units","L","H"]
[1,{"$f":"_Setup!B8","v":"ALP (Alkaline Phosphatase)"},{"$f":"_1!C6","v":30},{"$f":"_2!C6","v":33},{"$f":"_3!C6","v":22},{"$f":"_4!C6","v":22},{"$f":"_5!C6","v":155},{"$f":"_6!C6","v":44},{"$f":"_7!C6","v":55},{"$f":"_8!C6","v":66},{"$f":"_9!C6","v":88},{"$f":"_10!C6","v":150},{"$f":"_11!C6","v":170},{"$f":"_12!C6","v":180},{"$f":"_Setup!C8","v":"IU/L"},{"$f":"_Setup!D8","v":30},{"$f":"_Setup!E8","v":130}]
[2,{"$f":"_Setup!B9","v":"ALT (amino alanine transferase)"},{"$f":"_1!C7","v":0},{"$f":"_2!C7","v":0},{"$f":"_3!C7","v":0},{"$f":"_4!C7","v":0},{"$f":"_5!C7","v":0},{"$f":"_6!C7","v":0},{"$f":"_7!C7","v":0},{"$f":"_8!C7","v":0},{"$f":"_9!C7","v":0},{"$f":"_10!C7","v":0},{"$f":"_11!C7","v":0},{"$f":"_12!C7","v":0},{"$f":"_Setup!C9","v":"IU/L"},{"$f":"_Setup!D9","v":5},{"$f":"_Setup!E9","v":40}]
[3,{"$f":"_Setup!B10","v":"AST (aspartate aminotransferase)"},{"$f":"_1!C8","v":0},{"$f":"_2!C8","v":0},{"$f":"_3!C8","v":0},{"$f":"_4!C8","v":0},{"$f":"_5!C8","v":0},{"$f":"_6!C8","v":0},{"$f":"_7!C8","v":0},{"$f":"_8!C8","v":0},{"$f":"_9!C8","v":0},{"$f":"_10!C8","v":0},{"$f":"_11!C8","v":0},{"$f":"_12!C8","v":0},{"$f":"_Setup!C10","v":"IU/L"},{"$f":"_Setup!D10","v":10},{"$f":"_Setup!E10","v":45}]
[4,{"$f":"_Setup!B11","v":"Albumin, serum (Alb)"},{"$f":"_1!C9","v":0},{"$f":"_2!C9","v":0},{"$f":"_3!C9","v":0},{"$f":"_4!C9","v":0},{"$f":"_5!C9","v":0},{"$f":"_6!C9","v":0},{"$f":"_7!C9","v":0},{"$f":"_8!C9","v":0},{"$f":"_9!C9","v":0},{"$f":"_10!C9","v":0},{"$f":"_11!C9","v":0},{"$f":"_12!C9","v":0},{"$f":"_Setup!C11","v":"gm/dL "},{"$f":"_Setup!D11","v":3.5},{"$f":"_Setup!E11","v":5}]
[5,{"$f":"_Setup!B12","v":"Bilirubin, Total (Bili), serum"},{"$f":"_1!C10","v":0},{"$f":"_2!C10","v":0},{"$f":"_3!C10","v":0},{"$f":"_4!C10","v":0},{"$f":"_5!C10","v":0},{"$f":"_6!C10","v":0},{"$f":"_7!C10","v":0},{"$f":"_8!C10","v":0},{"$f":"_9!C10","v":0},{"$f":"_10!C10","v":0},{"$f":"_11!C10","v":0},{"$f":"_12!C10","v":0},{"$f":"_Setup!C12","v":"mg/dL"},{"$f":"_Setup!D12","v":0.2},{"$f":"_Setup!E12","v":1}]
[6,{"$f":"_Setup!B13","v":"BUN (Blood urea nitrogen)"},{"$f":"_1!C11","v":12},{"$f":"_2!C11","v":14},{"$f":"_3!C11","v":16},{"$f":"_4!C11","v":18},{"$f":"_5!C11","v":21},{"$f":"_6!C11","v":23},{"$f":"_7!C11","v":27},{"$f":"_8!C11","v":25},{"$f":"_9!C11","v":33},{"$f":"_10!C11","v":33},{"$f":"_11!C11","v":37},{"$f":"_12!C11","v":39},{"$f":"_Setup!C13","v":"mg/dL"},{"$f":"_Setup!D13","v":8},{"$f":"_Setup!E13","v":18}]
[7,{"$f":"_Setup!B14","v":"Ca - Calcium"},{"$f":"_1!C12","v":0},{"$f":"_2!C12","v":0},{"$f":"_3!C12","v":0},{"$f":"_4!C12","v":0},{"$f":"_5!C12","v":0},{"$f":"_6!C12","v":0},{"$f":"_7!C12","v":0},{"$f":"_8!C12","v":0},{"$f":"_9!C12","v":0},{"$f":"_10!C12","v":0},{"$f":"_11!C12","v":0},{"$f":"_12!C12","v":0},{"$f":"_Setup!C14","v":"mg/dL"},{"$f":"_Setup!D14","v":8.5},{"$f":"_Setup!E14","v":10.5}]
[8,{"$f":"_Setup!B15","v":"CI - Chloride"},{"$f":"_1!C13","v":0},{"$f":"_2!C13","v":0},{"$f":"_3!C13","v":0},{"$f":"_4!C13","v":0},{"$f":"_5!C13","v":0},{"$f":"_6!C13","v":0},{"$f":"_7!C13","v":0},{"$f":"_8!C13","v":0},{"$f":"_9!C13","v":0},{"$f":"_10!C13","v":0},{"$f":"_11!C13","v":0},{"$f":"_12!C13","v":0},{"$f":"_Setup!C15","v":"mEq/L"},{"$f":"_Setup!D16","v":20},{"$f":"_Setup!E16","v":29}]
[9,{"$f":"_Setup!B16","v":"CO2 - Carbon dioxide"},{"$f":"_1!C14","v":0},{"$f":"_2!C14","v":0},{"$f":"_3!C14","v":0},{"$f":"_4!C14","v":0},{"$f":"_5!C14","v":0},{"$f":"_6!C14","v":0},{"$f":"_7!C14","v":0},{"$f":"_8!C14","v":0},{"$f":"_9!C14","v":0},{"$f":"_10!C14","v":0},{"$f":"_11!C14","v":0},{"$f":"_12!C14","v":0},{"$f":"_Setup!C17","v":"mg/dL"},{"$f":"_Setup!D17","v":0.6},{"$f":"_Setup!E17","v":1.5}]
[10,{"$f":"_Setup!B17","v":"CRT - Creatinine"},{"$f":"_1!C15","v":0},{"$f":"_2!C15","v":0},{"$f":"_3!C15","v":0},{"$f":"_4!C15","v":0},{"$f":"_5!C15","v":0},{"$f":"_6!C15","v":0},{"$f":"_7!C15","v":0},{"$f":"_8!C15","v":0},{"$f":"_9!C15","v":0},{"$f":"_10!C15","v":0},{"$f":"_11!C15","v":0},{"$f":"_12!C15","v":0},{"$f":"_Setup!C17","v":"mg/dL"},{"$f":"_Setup!D17","v":0.6},{"$f":"_Setup!E17","v":1.5}]
[11,{"$f":"_Setup!B18","v":"Glucose"},{"$f":"_1!C16","v":0},{"$f":"_2!C16","v":0},{"$f":"_3!C16","v":0},{"$f":"_4!C16","v":0},{"$f":"_5!C16","v":0},{"$f":"_6!C16","v":0},{"$f":"_7!C16","v":0},{"$f":"_8!C16","v":0},{"$f":"_9!C16","v":0},{"$f":"_10!C16","v":0},{"$f":"_11!C16","v":0},{"$f":"_12!C16","v":0},{"$f":"_Setup!C18","v":"mg/dL"},{"$f":"_Setup!D18","v":65},{"$f":"_Setup!E18","v":110}]
[12,{"$f":"_Setup!B19","v":"Mg - Magnesium"},{"$f":"_1!C17","v":0},{"$f":"_2!C17","v":0},{"$f":"_3!C17","v":0},{"$f":"_4!C17","v":0},{"$f":"_5!C17","v":0},{"$f":"_6!C17","v":0},{"$f":"_7!C17","v":0},{"$f":"_8!C17","v":0},{"$f":"_9!C17","v":0},{"$f":"_10!C17","v":0},{"$f":"_11!C17","v":0},{"$f":"_12!C17","v":0},{"$f":"_Setup!C19","v":"mg/dL"},{"$f":"_Setup!D19","v":1.8},{"$f":"_Setup!E19","v":2.5}]
[13,{"$f":"_Setup!B20","v":"Potassium (K)"},{"$f":"_1!C18","v":0},{"$f":"_2!C18","v":0},{"$f":"_3!C18","v":0},{"$f":"_4!C18","v":0},{"$f":"_5!C18","v":0},{"$f":"_6!C18","v":0},{"$f":"_7!C18","v":0},{"$f":"_8!C18","v":0},{"$f":"_9!C18","v":0},{"$f":"_10!C18","v":0},{"$f":"_11!C18","v":0},{"$f":"_12!C18","v":0},{"$f":"_Setup!C20","v":"mEq/L"},{"$f":"_Setup!D20","v":3.5},{"$f":"_Setup!E20","v":5}]
[14,{"$f":"_Setup!B21","v":"Sodium (Na)"},{"$f":"_1!C19","v":0},{"$f":"_2!C19","v":0},{"$f":"_3!C19","v":0},{"$f":"_4!C19","v":0},{"$f":"_5!C19","v":0},{"$f":"_6!C19","v":0},{"$f":"_7!C19","v":0},{"$f":"_8!C19","v":0},{"$f":"_9!C19","v":0},{"$f":"_10!C19","v":0},{"$f":"_11!C19","v":0},{"$f":"_12!C19","v":0},{"$f":"_Setup!C21","v":"mEq/L"},{"$f":"_Setup!D21","v":135},{"$f":"_Setup!E21","v":145}]
[15,{"$f":"_Setup!B22","v":"Total Protein"},{"$f":"_1!C20","v":0},{"$f":"_2!C20","v":0},{"$f":"_3!C20","v":0},{"$f":"_4!C20","v":0},{"$f":"_5!C20","v":0},{"$f":"_6!C20","v":0},{"$f":"_7!C20","v":0},{"$f":"_8!C20","v":0},{"$f":"_9!C20","v":0},{"$f":"_10!C20","v":0},{"$f":"_11!C20","v":0},{"$f":"_12!C20","v":0},{"$f":"_Setup!C22","v":"gm/dL "},{"$f":"_Setup!D22","v":6},{"$f":"_Setup!E22","v":8}]
[16,{"$f":"_Setup!B23","v":"RBC - Red Blood Cells"},{"$f":"_1!C21","v":0},{"$f":"_2!C21","v":0},{"$f":"_3!C21","v":0},{"$f":"_4!C21","v":0},{"$f":"_5!C21","v":0},{"$f":"_6!C21","v":0},{"$f":"_7!C21","v":0},{"$f":"_8!C21","v":0},{"$f":"_9!C21","v":0},{"$f":"_10!C21","v":0},{"$f":"_11!C21","v":0},{"$f":"_12!C21","v":0},{"$f":"_Setup!C23","v":"(X106/uL)"},{"$f":"_Setup!D23","v":4.4000000000000004},{"$f":"_Setup!E23","v":5.6}]
[17,{"$f":"_Setup!B24","v":"Hgb - Hemoglobin"},{"$f":"_1!C22","v":0},{"$f":"_2!C22","v":0},{"$f":"_3!C22","v":0},{"$f":"_4!C22","v":0},{"$f":"_5!C22","v":0},{"$f":"_6!C22","v":0},{"$f":"_7!C22","v":0},{"$f":"_8!C22","v":0},{"$f":"_9!C22","v":0},{"$f":"_10!C22","v":0},{"$f":"_11!C22","v":0},{"$f":"_12!C22","v":0},{"$f":"_Setup!C24","v":"(g/dL)"},{"$f":"_Setup!D24","v":13},{"$f":"_Setup!E24","v":18}]
[18,{"$f":"_Setup!B25","v":"Hct - Hematocrtit"},{"$f":"_1!C23","v":0},{"$f":"_2!C23","v":0},{"$f":"_3!C23","v":0},{"$f":"_4!C23","v":0},{"$f":"_5!C23","v":0},{"$f":"_6!C23","v":0},{"$f":"_7!C23","v":0},{"$f":"_8!C23","v":0},{"$f":"_9!C23","v":0},{"$f":"_10!C23","v":0},{"$f":"_11!C23","v":0},{"$f":"_12!C23","v":0},{"$f":"_Setup!C25","v":"%"},{"$f":"_Setup!D25","v":0.38},{"$f":"_Setup!E25","v":0.5}]
[19,{"$f":"_Setup!B26","v":"MCV - Mean Corp. Volume"},{"$f":"_1!C24","v":0},{"$f":"_2!C24","v":0},{"$f":"_3!C24","v":0},{"$f":"_4!C24","v":0},{"$f":"_5!C24","v":0},{"$f":"_6!C24","v":0},{"$f":"_7!C24","v":0},{"$f":"_8!C24","v":0},{"$f":"_9!C24","v":0},{"$f":"_10!C24","v":0},{"$f":"_11!C24","v":0},{"$f":"_12!C24","v":0},{"$f":"_Setup!C26","v":"(fL)"},{"$f":"_Setup!D26","v":81},{"$f":"_Setup!E26","v":98}]
[20,{"$f":"_Setup!B27","v":"MCH - Mean Corp. Hgb"},{"$f":"_1!C25","v":0},{"$f":"_2!C25","v":0},{"$f":"_3!C25","v":0},{"$f":"_4!C25","v":0},{"$f":"_5!C25","v":0},{"$f":"_6!C25","v":0},{"$f":"_7!C25","v":0},{"$f":"_8!C25","v":0},{"$f":"_9!C25","v":0},{"$f":"_10!C25","v":0},{"$f":"_11!C25","v":0},{"$f":"_12!C25","v":0},{"$f":"_Setup!C27","v":"(pg)"},{"$f":"_Setup!D27","v":27.3},{"$f":"_Setup!E27","v":33.6}]
[21,{"$f":"_Setup!B28","v":"MCHC - Mean Corp. Hgb Concentration"},{"$f":"_1!C26","v":0},{"$f":"_2!C26","v":0},{"$f":"_3!C26","v":0},{"$f":"_4!C26","v":0},{"$f":"_5!C26","v":0},{"$f":"_6!C26","v":0},{"$f":"_7!C26","v":0},{"$f":"_8!C26","v":0},{"$f":"_9!C26","v":0},{"$f":"_10!C26","v":0},{"$f":"_11!C26","v":0},{"$f":"_12!C26","v":0},{"$f":"_Setup!C28","v":"(g/dL)"},{"$f":"_Setup!D28","v":32.299999999999997},{"$f":"_Setup!E28","v":35.700000000000003}]
[22,{"$f":"_Setup!B29","v":"RDW - Red cell Dist Width"},{"$f":"_1!C27","v":0},{"$f":"_2!C27","v":0},{"$f":"_3!C27","v":0},{"$f":"_4!C27","v":0},{"$f":"_5!C27","v":0},{"$f":"_6!C27","v":0},{"$f":"_7!C27","v":0},{"$f":"_8!C27","v":0},{"$f":"_9!C27","v":0},{"$f":"_10!C27","v":0},{"$f":"_11!C27","v":0},{"$f":"_12!C27","v":0},{"$f":"_Setup!C29","v":"%"},{"$f":"_Setup!D29","v":0.11799999999999999},{"$f":"_Setup!E29","v":0.14099999999999999}]
[23,{"$f":"_Setup!B30","v":"ESR - Erythrocyte Sedimentation Rate"},{"$f":"_1!C28","v":0},{"$f":"_2!C28","v":0},{"$f":"_3!C28","v":0},{"$f":"_4!C28","v":0},{"$f":"_5!C28","v":0},{"$f":"_6!C28","v":0},{"$f":"_7!C28","v":0},{"$f":"_8!C28","v":0},{"$f":"_9!C28","v":0},{"$f":"_10!C28","v":0},{"$f":"_11!C28","v":0},{"$f":"_12!C28","v":0},{"$f":"_Setup!C30","v":"mm/hr"},{"$f":"_Setup!D30","v":0.01},{"$f":"_Setup!E30","v":20}]
[24,{"$f":"_Setup!B31","v":"Platelets (Thrombocytes)"},{"$f":"_1!C29","v":0},{"$f":"_2!C29","v":0},{"$f":"_3!C29","v":0},{"$f":"_4!C29","v":0},{"$f":"_5!C29","v":0},{"$f":"_6!C29","v":0},{"$f":"_7!C29","v":0},{"$f":"_8!C29","v":0},{"$f":"_9!C29","v":0},{"$f":"_10!C29","v":0},{"$f":"_11!C29","v":0},{"$f":"_12!C29","v":0},{"$f":"_Setup!C31","v":"(X103/uL)"},{"$f":"_Setup!D31","v":150},{"$f":"_Setup!E31","v":400}]
[25,{"$f":"_Setup!B32","v":"WBC - White blood cells"},{"$f":"_1!C30","v":0},{"$f":"_2!C30","v":0},{"$f":"_3!C30","v":0},{"$f":"_4!C30","v":0},{"$f":"_5!C30","v":0},{"$f":"_6!C30","v":0},{"$f":"_7!C30","v":0},{"$f":"_8!C30","v":0},{"$f":"_9!C30","v":0},{"$f":"_10!C30","v":0},{"$f":"_11!C30","v":0},{"$f":"_12!C30","v":0},{"$f":"_Setup!C32","v":"(X103/uL)"},{"$f":"_Setup!D32","v":4.3},{"$f":"_Setup!E32","v":10}]
[26,{"$f":"_Setup!B33","v":"Basophils"},{"$f":"_1!C31","v":0},{"$f":"_2!C31","v":0},{"$f":"_3!C31","v":0},{"$f":"_4!C31","v":0},{"$f":"_5!C31","v":0},{"$f":"_6!C31","v":0},{"$f":"_7!C31","v":0},{"$f":"_8!C31","v":0},{"$f":"_9!C31","v":0},{"$f":"_10!C31","v":0},{"$f":"_11!C31","v":0},{"$f":"_12!C31","v":0},{"$f":"_Setup!C33","v":"(X103/uL)"},{"$f":"_Setup!D33","v":0.01},{"$f":"_Setup!E33","v":0.2}]
[27,{"$f":"_Setup!B34","v":"Eosinophils"},{"$f":"_1!C32","v":0},{"$f":"_2!C32","v":0},{"$f":"_3!C32","v":0},{"$f":"_4!C32","v":0},{"$f":"_5!C32","v":0},{"$f":"_6!C32","v":0},{"$f":"_7!C32","v":0},{"$f":"_8!C32","v":0},{"$f":"_9!C32","v":0},{"$f":"_10!C32","v":0},{"$f":"_11!C32","v":0},{"$f":"_12!C32","v":0},{"$f":"_Setup!C34","v":"(X103/uL)"},{"$f":"_Setup!D34","v":0.01},{"$f":"_Setup!E34","v":0.5}]
[28,{"$f":"_Setup!B35","v":"Monocytes"},{"$f":"_1!C33","v":0},{"$f":"_2!C33","v":0},{"$f":"_3!C33","v":0},{"$f":"_4!C33","v":0},{"$f":"_5!C33","v":0},{"$f":"_6!C33","v":0},{"$f":"_7!C33","v":0},{"$f":"_8!C33","v":0},{"$f":"_9!C33","v":0},{"$f":"_10!C33","v":0},{"$f":"_11!C33","v":0},{"$f":"_12!C33","v":0},{"$f":"_Setup!C35","v":"(X103/uL)"},{"$f":"_Setup!D35","v":0.01},{"$f":"_Setup!E35","v":0.8}]
[29,{"$f":"_Setup!B36","v":"Total Neutrophils"},{"$f":"_1!C34","v":0},{"$f":"_2!C34","v":0},{"$f":"_3!C34","v":0},{"$f":"_4!C34","v":0},{"$f":"_5!C34","v":0},{"$f":"_6!C34","v":0},{"$f":"_7!C34","v":0},{"$f":"_8!C34","v":0},{"$f":"_9!C34","v":0},{"$f":"_10!C34","v":0},{"$f":"_11!C34","v":0},{"$f":"_12!C34","v":0},{"$f":"_Setup!C36","v":"%"},{"$f":"_Setup!D36","v":38},{"$f":"_Setup!E36","v":80}]
[30,{"$f":"_Setup!B37","v":"Total Neutrophils, Absolute (ANC)"},{"$f":"_1!C35","v":0},{"$f":"_2!C35","v":0},{"$f":"_3!C35","v":0},{"$f":"_4!C35","v":0},{"$f":"_5!C35","v":0},{"$f":"_6!C35","v":0},{"$f":"_7!C35","v":0},{"$f":"_8!C35","v":0},{"$f":"_9!C35","v":0},{"$f":"_10!C35","v":0},{"$f":"_11!C35","v":0},{"$f":"_12!C35","v":0},{"$f":"_Setup!C37","v":"Cells/Cu.Mm"},{"$f":"_Setup!D37","v":1650},{"$f":"_Setup!E37","v":8000}]
[31,{"$f":"_Setup!B38","v":"Total Lymphocytes"},{"$f":"_1!C36","v":0},{"$f":"_2!C36","v":0},{"$f":"_3!C36","v":0},{"$f":"_4!C36","v":0},{"$f":"_5!C36","v":0},{"$f":"_6!C36","v":0},{"$f":"_7!C36","v":0},{"$f":"_8!C36","v":0},{"$f":"_9!C36","v":0},{"$f":"_10!C36","v":0},{"$f":"_11!C36","v":0},{"$f":"_12!C36","v":0},{"$f":"_Setup!C38","v":"%"},{"$f":"_Setup!D38","v":15},{"$f":"_Setup!E38","v":49}]
[32,{"$f":"_Setup!B39","v":"Total Lymphocytes, Absolute"},{"$f":"_1!C37","v":0},{"$f":"_2!C37","v":0},{"$f":"_3!C37","v":0},{"$f":"_4!C37","v":0},{"$f":"_5!C37","v":0},{"$f":"_6!C37","v":0},{"$f":"_7!C37","v":0},{"$f":"_8!C37","v":0},{"$f":"_9!C37","v":0},{"$f":"_10!C37","v":0},{"$f":"_11!C37","v":0},{"$f":"_12!C37","v":0},{"$f":"_Setup!C39","v":"Cells/Cu.Mm"},{"$f":"_Setup!D39","v":1000},{"$f":"_Setup!E39","v":3500}]
[33,{"$f":"_Setup!B40","v":"Monocytes"},{"$f":"_1!C38","v":0},{"$f":"_2!C38","v":0},{"$f":"_3!C38","v":0},{"$f":"_4!C38","v":0},{"$f":"_5!C38","v":0},{"$f":"_6!C38","v":0},{"$f":"_7!C38","v":0},{"$f":"_8!C38","v":0},{"$f":"_9!C38","v":0},{"$f":"_10!C38","v":0},{"$f":"_11!C38","v":0},{"$f":"_12!C38","v":0},{"$f":"_Setup!C40","v":"%"},{"$f":"_Setup!D40","v":0.01},{"$f":"_Setup!E40","v":13}]
[34,{"$f":"_Setup!B41","v":"Monocytes, Absolute "},{"$f":"_1!C39","v":0},{"$f":"_2!C39","v":0},{"$f":"_3!C39","v":0},{"$f":"_4!C39","v":0},{"$f":"_5!C39","v":0},{"$f":"_6!C39","v":0},{"$f":"_7!C39","v":0},{"$f":"_8!C39","v":0},{"$f":"_9!C39","v":0},{"$f":"_10!C39","v":0},{"$f":"_11!C39","v":0},{"$f":"_12!C39","v":0},{"$f":"_Setup!C41","v":"Cells/Cu.Mm"},{"$f":"_Setup!D41","v":40},{"$f":"_Setup!E41","v":900}]
[35,{"$f":"_Setup!B42","v":"Basophils"},{"$f":"_1!C40","v":0},{"$f":"_2!C40","v":0},{"$f":"_3!C40","v":0},{"$f":"_4!C40","v":0},{"$f":"_5!C40","v":0},{"$f":"_6!C40","v":0},{"$f":"_7!C40","v":0},{"$f":"_8!C40","v":0},{"$f":"_9!C40","v":0},{"$f":"_10!C40","v":0},{"$f":"_11!C40","v":0},{"$f":"_12!C40","v":0},{"$f":"_Setup!C42","v":"%"},{"$f":"_Setup!D42","v":0.01},{"$f":"_Setup!E42","v":2}]
[36,{"$f":"_Setup!B43","v":"Basophils, Absolute"},{"$f":"_1!C41","v":0},{"$f":"_2!C41","v":0},{"$f":"_3!C41","v":0},{"$f":"_4!C41","v":0},{"$f":"_5!C41","v":0},{"$f":"_6!C41","v":0},{"$f":"_7!C41","v":0},{"$f":"_8!C41","v":0},{"$f":"_9!C41","v":0},{"$f":"_10!C41","v":0},{"$f":"_11!C41","v":0},{"$f":"_12!C41","v":0},{"$f":"_Setup!C43","v":"Cells/Cu.Mm"},{"$f":"_Setup!D43","v":0.01},{"$f":"_Setup!E43","v":125}]
[37,{"$f":"_Setup!B44","v":"Eosinophils"},{"$f":"_1!C42","v":0},{"$f":"_2!C42","v":0},{"$f":"_3!C42","v":0},{"$f":"_4!C42","v":0},{"$f":"_5!C42","v":0},{"$f":"_6!C42","v":0},{"$f":"_7!C42","v":0},{"$f":"_8!C42","v":0},{"$f":"_9!C42","v":0},{"$f":"_10!C42","v":0},{"$f":"_11!C42","v":0},{"$f":"_12!C42","v":0},{"$f":"_Setup!C44","v":"%"},{"$f":"_Setup!D44","v":0.01},{"$f":"_Setup!E44","v":8}]
[38,{"$f":"_Setup!B45","v":"Eosinophils, Absolute"},{"$f":"_1!C43","v":0},{"$f":"_2!C43","v":0},{"$f":"_3!C43","v":0},{"$f":"_4!C43","v":0},{"$f":"_5!C43","v":0},{"$f":"_6!C43","v":0},{"$f":"_7!C43","v":0},{"$f":"_8!C43","v":0},{"$f":"_9!C43","v":0},{"$f":"_10!C43","v":0},{"$f":"_11!C43","v":0},{"$f":"_12!C43","v":0},{"$f":"_Setup!C45","v":"Cells/Cu.Mm"},{"$f":"_Setup!D45","v":30},{"$f":"_Setup!E45","v":600}]
[39,{"$f":"_Setup!B46","v":"Cholesterol, total"},{"$f":"_1!C44","v":0},{"$f":"_2!C44","v":0},{"$f":"_3!C44","v":0},{"$f":"_4!C44","v":0},{"$f":"_5!C44","v":0},{"$f":"_6!C44","v":0},{"$f":"_7!C44","v":0},{"$f":"_8!C44","v":0},{"$f":"_9!C44","v":0},{"$f":"_10!C44","v":0},{"$f":"_11!C44","v":0},{"$f":"_12!C44","v":0},{"$f":"_Setup!C46","v":"mg/dL"},{"$f":"_Setup!D46","v":130},{"$f":"_Setup!E46","v":200}]
[40,{"$f":"_Setup!B47","v":"Triglycerides"},{"$f":"_1!C45","v":0},{"$f":"_2!C45","v":0},{"$f":"_3!C45","v":0},{"$f":"_4!C45","v":0},{"$f":"_5!C45","v":0},{"$f":"_6!C45","v":0},{"$f":"_7!C45","v":0},{"$f":"_8!C45","v":0},{"$f":"_9!C45","v":0},{"$f":"_10!C45","v":0},{"$f":"_11!C45","v":0},{"$f":"_12!C45","v":0},{"$f":"_Setup!C47","v":"mg/dL"},{"$f":"_Setup!D47","v":10},{"$f":"_Setup!E47","v":150}]
[41,{"$f":"_Setup!B48","v":"Lactate dehydrogenase (LDH)"},{"$f":"_1!C46","v":0},{"$f":"_2!C46","v":0},{"$f":"_3!C46","v":0},{"$f":"_4!C46","v":0},{"$f":"_5!C46","v":0},{"$f":"_6!C46","v":0},{"$f":"_7!C46","v":0},{"$f":"_8!C46","v":0},{"$f":"_9!C46","v":0},{"$f":"_10!C46","v":0},{"$f":"_11!C46","v":0},{"$f":"_12!C46","v":0},{"$f":"_Setup!C48","v":" u/l "},{"$f":"_Setup!D48","v":100},{"$f":"_Setup!E48","v":190}]
[42,{"$f":"_Setup!B49","v":"Beta-2 Microglobulin (B2M)"},{"$f":"_1!C47","v":0},{"$f":"_2!C47","v":0},{"$f":"_3!C47","v":0},{"$f":"_4!C47","v":0},{"$f":"_5!C47","v":0},{"$f":"_6!C47","v":0},{"$f":"_7!C47","v":0},{"$f":"_8!C47","v":0},{"$f":"_9!C47","v":0},{"$f":"_10!C47","v":0},{"$f":"_11!C47","v":0},{"$f":"_12!C47","v":0},{"$f":"_Setup!C49","v":"g/ml"},{"$f":"_Setup!D49","v":0.01},{"$f":"_Setup!E49","v":2.5}]
[43,{"$f":"_Setup!B50","v":"Uric acid"},{"$f":"_1!C48","v":0},{"$f":"_2!C48","v":0},{"$f":"_3!C48","v":0},{"$f":"_4!C48","v":0},{"$f":"_5!C48","v":0},{"$f":"_6!C48","v":0},{"$f":"_7!C48","v":0},{"$f":"_8!C48","v":0},{"$f":"_9!C48","v":0},{"$f":"_10!C48","v":0},{"$f":"_11!C48","v":0},{"$f":"_12!C48","v":0},{"$f":"_Setup!C50","v":"mg/dL"},{"$f":"_Setup!D50","v":2.5},{"$f":"_Setup!E50","v":8}]
[44,{"$f":"_Setup!B51","v":"Urine Albumin /  Albumin/Creatinine Ratio"},{"$f":"_1!C49","v":0},{"$f":"_2!C49","v":0},{"$f":"_3!C49","v":0},{"$f":"_4!C49","v":0},{"$f":"_5!C49","v":0},{"$f":"_6!C49","v":0},{"$f":"_7!C49","v":0},{"$f":"_8!C49","v":0},{"$f":"_9!C49","v":0},{"$f":"_10!C49","v":0},{"$f":"_11!C49","v":0},{"$f":"_12!C49","v":0},{"$f":"_Setup!C51","v":0},{"$f":"_Setup!D51","v":0},{"$f":"_Setup!E51","v":0}]
[45,{"$f":"_Setup!B52","v":"eGFR"},{"$f":"_1!C50","v":0},{"$f":"_2!C50","v":0},{"$f":"_3!C50","v":0},{"$f":"_4!C50","v":0},{"$f":"_5!C50","v":0},{"$f":"_6!C50","v":0},{"$f":"_7!C50","v":0},{"$f":"_8!C50","v":0},{"$f":"_9!C50","v":0},{"$f":"_10!C50","v":0},{"$f":"_11!C50","v":0},{"$f":"_12!C50","v":0},{"$f":"_Setup!C52","v":"mL/min/1.73m"},{"$f":"_Setup!D52","v":60},{"$f":"_Setup!E52","v":100}]
[46,{"$f":"_Setup!B53","v":"cystatin C "},{"$f":"_1!C51","v":0},{"$f":"_2!C51","v":0},{"$f":"_3!C51","v":0},{"$f":"_4!C51","v":0},{"$f":"_5!C51","v":0},{"$f":"_6!C51","v":0},{"$f":"_7!C51","v":0},{"$f":"_8!C51","v":0},{"$f":"_9!C51","v":0},{"$f":"_10!C51","v":0},{"$f":"_11!C51","v":0},{"$f":"_12!C51","v":0},{"$f":"_Setup!C53","v":0},{"$f":"_Setup!D53","v":0},{"$f":"_Setup!E53","v":0}]
[47,{"$f":"_Setup!B54","v":"Custom 4"},{"$f":"_1!C52","v":0},{"$f":"_2!C52","v":0},{"$f":"_3!C52","v":0},{"$f":"_4!C52","v":0},{"$f":"_5!C52","v":0},{"$f":"_6!C52","v":0},{"$f":"_7!C52","v":0},{"$f":"_8!C52","v":0},{"$f":"_9!C52","v":0},{"$f":"_10!C52","v":0},{"$f":"_11!C52","v":0},{"$f":"_12!C52","v":0},{"$f":"_Setup!C54","v":0},{"$f":"_Setup!D54","v":0},{"$f":"_Setup!E54","v":0}]
[48,{"$f":"_Setup!B55","v":"Custom 5"},{"$f":"_1!C53","v":0},{"$f":"_2!C53","v":0},{"$f":"_3!C53","v":0},{"$f":"_4!C53","v":0},{"$f":"_5!C53","v":0},{"$f":"_6!C53","v":0},{"$f":"_7!C53","v":0},{"$f":"_8!C53","v":0},{"$f":"_9!C53","v":0},{"$f":"_10!C53","v":0},{"$f":"_11!C53","v":0},{"$f":"_12!C53","v":0},{"$f":"_Setup!C55","v":0},{"$f":"_Setup!D55","v":0},{"$f":"_Setup!E55","v":0}]

{"sheet":"_Plot","index":3,"n_rows":44,"n_cols":16,"rows_kept":44,"cut":false,"hidden":false,"merged":[]}
[]
[]
[null,null,null,null,null,null,null,null,null,null,null,null,"Lab 1","Lab 2","Lab 3","Lab 4"]
[null,null,"Lab Plots",null,"Units","Low","High",null,null,null,null,null,"Lab 5","Lab 6","Lab 7","Lab 8"]
[null,null,null,null,{"$f":"VLOOKUP(_C1P,_report_table,15)","v":"IU/L"},{"$f":"VLOOKUP(_C1P,_report_table,16)","v":30},{"$f":"VLOOKUP(_C1P,_report_table,17)","v":130},null,null,null,null,null,"Lab 9","Lab 10","Lab 11","Lab 12"]
[]
["Lab Setup",null,"1 of 2","Dates:",{"$f":"_Reports!$C$5","v":"2017-01-01"},{"$f":"_Reports!$D$5","v":"00:00:00"},{"$f":"_Reports!$E$5","v":"00:00:00"},{"$f":"_Reports!$F$5","v":"00:00:00"},{"$f":"_Reports!$G$5","v":"00:00:00"},{"$f":"_Reports!$H$5","v":"00:00:00"},{"$f":"_Reports!$I$5","v":"00:00:00"},{"$f":"_Reports!$J$5","v":"00:00:00"},{"$f":"_Reports!$K$5","v":"00:00:00"},{"$f":"_Reports!$L$5","v":"00:00:00"},{"$f":"_Reports!$M$5","v":"00:00:00"},{"$f":"_Reports!$N$5","v":"00:00:00"}]
["Lab Report",null,{"$f":"VLOOKUP(_C1P,_report_table,2)","v":"ALP (Alkaline Phosphatase)"},"Labs:","Lab 1","Lab 2","Lab 3","Lab 4","Lab 5","Lab 6","Lab 7","Lab 8","Lab 9","Lab 10","Lab 11","Lab 12"]
["Report row",null,null,null,{"$f":"VLOOKUP(_C1P,_report_table,3)","v":30},{"$f":"VLOOKUP(_C1P,_report_table,4)","v":33},{"$f":"VLOOKUP(_C1P,_report_table,5)","v":22},{"$f":"VLOOKUP(_C1P,_report_table,6)","v":22},{"$f":"VLOOKUP(_C1P,_report_table,7)","v":155},{"$f":"VLOOKUP(_C1P,_report_table,8)","v":44},{"$f":"VLOOKUP(_C1P,_report_table,9)","v":55},{"$f":"VLOOKUP(_C1P,_report_table,10)","v":66},{"$f":"VLOOKUP(_C1P,_report_table,11)","v":88},{"$f":"VLOOKUP(_C1P,_report_table,12)","v":150},{"$f":"VLOOKUP(_C1P,_report_table,13)","v":170},{"$f":"VLOOKUP(_C1P,_report_table,14)","v":180}]
[1,null,"<= type row number from Lab Report",null,{"$f":"IF(E9=0,\" \",IF(E9<$F$5,\"L\",IF(E9>$G$5,\"H\",\" \")))","v":" "},{"$f":"IF(F9=0,\" \",IF(F9<$F$5,\"L\",IF(F9>$G$5,\"H\",\" \")))","v":" "},"L","L","H"," "," "," "," ","H","H","H"]
[]
[]
[]
[]
[]
[]
[]
[]
[]
[]
[]
[]
[]
[]
[]
[]
[]
[]
[]
[]
[]
[]
[]
[]
[]
[]
[]
[null,null,null,null,"Units","Low","High"]
[null,null,null,null,{"$f":"VLOOKUP($A$44,_report_table,15)","v":"mg/dL"},{"$f":"VLOOKUP($A$44,_report_table,16)","v":8},{"$f":"VLOOKUP($A$44,_report_table,17)","v":18}]
[]
[null,null,"2 of 2","Dates:",{"$f":"_Reports!$C$5","v":"2017-01-01"},{"$f":"_Reports!$D$5","v":"00:00:00"},{"$f":"_Reports!$E$5","v":"00:00:00"},{"$f":"_Reports!$F$5","v":"00:00:00"},{"$f":"_Reports!$G$5","v":"00:00:00"},{"$f":"_Reports!$H$5","v":"00:00:00"},{"$f":"_Reports!$I$5","v":"00:00:00"},{"$f":"_Reports!$J$5","v":"00:00:00"},{"$f":"_Reports!$K$5","v":"00:00:00"},{"$f":"_Reports!$L$5","v":"00:00:00"},{"$f":"_Reports!$M$5","v":"00:00:00"},{"$f":"_Reports!$N$5","v":"00:00:00"}]
[null,null,{"$f":"VLOOKUP(A44,_report_table,2)","v":"BUN (Blood urea nitrogen)"},"Labs:","Lab 1","Lab 2","Lab 3","Lab 4","Lab 5","Lab 6","Lab 7","Lab 8","Lab 9","Lab 10","Lab 11","Lab 12"]
["Report row",null,null,null,{"$f":"VLOOKUP(A44,_report_table,3)","v":12},{"$f":"VLOOKUP($A$44,_report_table,4)","v":14},{"$f":"VLOOKUP($A$44,_report_table,5)","v":16},{"$f":"VLOOKUP($A$44,_report_table,6)","v":18},{"$f":"VLOOKUP($A$44,_report_table,7)","v":21},{"$f":"VLOOKUP($A$44,_report_table,8)","v":23},{"$f":"VLOOKUP($A$44,_report_table,9)","v":27},{"$f":"VLOOKUP($A$44,_report_table,10)","v":25},{"$f":"VLOOKUP($A$44,_report_table,11)","v":33},{"$f":"VLOOKUP($A$44,_report_table,12)","v":33},{"$f":"VLOOKUP($A$44,_report_table,13)","v":37},{"$f":"VLOOKUP($A$44,_report_table,14)","v":39}]
[6,null,"<= type row number from Lab Report",null,{"$f":"IF(E43=0,\" \",IF(E43<$F$39,\"L\",IF(E43>$G$39,\"H\",\" \")))","v":" "},{"$f":"IF(F43=0,\" \",IF(F43<$F$39,\"L\",IF(F43>$G$39,\"H\",\" \")))","v":" "}," "," ","H","H","H","H","H","H","H","H"]

{"sheet":"_Me","index":4,"n_rows":27,"n_cols":11,"rows_kept":27,"cut":false,"hidden":false,"merged":[[12,7,12,11],[13,10,13,11],[2,7,2,11],[3,7,3,11],[4,10,4,11],[10,10,10,11],[6,1,6,5],[6,7,6,11],[7,1,7,5],[9,7,9,11],[7,10,7,11],[8,1,8,5],[20,1,20,3],[20,4,20,5],[20,6,20,11],[15,1,15,11],[17,1,17,3],[17,5,17,6],[19,1,19,3],[19,4,19,5],[19,6,19,11]]}
[]
["My Record"]
["Medical Providers "]
["Insurance Provider",null,null,null,null,null,"My Primary Care Doctor:",{"$f":"_Team!C10","v":"My doctor's name"}]
["Insurance Log",null,null,null,null,null,"Phone: ",{"$f":"_Team!D10","v":"999-999-9999"},null,"Fax: ",{"$f":"_Team!E10","v":"999-999-9999"}]
[null,"Me"]
["My name or alias: ","First name / last name",null,null,null,null,"Oncologist: ",{"$f":"_Team!C8","v":"Type oncologist name"}]
["Address: ","Type your address here",null,null,null,null,"Phone: ",{"$f":"_Team!D8","v":"999-999-9999"},null,"Fax: ",{"$f":"_Team!E8","v":"999-999-9999"}]
["Email: "]
["Phone: ",null,null,null,null,null,"Assistant: ",{"$f":"_Team!C9","v":"Assistant name"}]
["Fax: ",null,null,null,null,null,"Phone: ",{"$f":"_Team!D9","v":"999-999-9999"},null,"Fax: ",{"$f":"_Team!E9","v":"999-999-9999"}]
[]
[null,null,null,null,null,null,"Emergency Contact: ","Name of emergency contact"]
[null,null,null,null,null,null,"Phone: ","999-999-9999",null,"Fax: ","999-999-9999"]
[]
["Diagnosis:  ","Diagnosis"]
[]
["Grade: ",null,null,null,"Stage: "]
[]
[null,"Markers",null,null,"Gene",null,"Other"]
["Diagnostic profile: ","Markers?",null,null,"Genes?",null,"Other?"]
[]
["Date of Diagnosis: ","1996-01-12","Gender","M/F","Diagnosis Confirmed:  ","Y/N","DOB:","1940-01-01"]
[null,null,null,null,"Years to date:  ",{"$f":"(NOW()-B23)/365","v":21.987455903411977},"Age:",{"$f":"(NOW() - H23)/365","v":78.055949054414}]
[]
[]
[null,null,null,"add markers - make it a list?"]

{"sheet":"_Team","index":5,"n_rows":23,"n_cols":8,"rows_kept":23,"cut":false,"hidden":false,"merged":[]}
[]
["Me"]
["Medical Providers "]
["Insurance Provider"]
["Insurance Log",null,"Medical Providers"]
[]
[null,"REQUIRED","Oncologist/assistant","Phone","Fax","Cell","Preferred time","Address / email"]
[null,"Oncologist","Type oncologist name","999-999-9999","999-999-9999","999-999-9999"]
[null,"Assistant","Assistant name","999-999-9999","999-999-9999"]
[null,"Primary Care Physcian","My doctor's name","999-999-9999","999-999-9999"]
[]
[null,null,"Additional  Providers:"]
[]
[null,"Type","Name","Phone","Fax","Cell","Preferred time","Address"]
[null,"Pharmacist"]
[null,"pre-admission approval"]
[null,"Emergency Room"]
[null,"Dentist"]
[null,"Nurse"]
[null,"Surgeon"]
[null,"Oncology Nurse"]
[null,"Radiation Oncologist"]
[null,"Radiology Contact"]

{"sheet":"Med_Suppl","index":6,"n_rows":7,"n_cols":17,"rows_kept":7,"cut":false,"hidden":false,"merged":[[2,1,2,16],[4,3,4,8],[3,15,3,16],[4,9,4,16],[3,1,3,12]]}
[]
[]
[null,"Medication / Supplment Schedule - a good form to print out after completing"]
["Patient:  ",{"$f":"_Me!B7","v":"First name / last name"},null,null,null,null,null,null,null,null,null,null,null,"Date:  "]
[null,null,null,"Daily Schedule\n WF = with Food  | X = number of pills | ES = Empty Stomach"]
["Med / Suppl & dose","Date Started ","Date Stopped","Wake","Break\nfeast","Lunch","Dinner","Bed","Late","Special Instructions","Purpose","Size, Shape, Color","Prescribing Physician","Physician Phone Number","Side Effects?","Refill Number","Pharmacy Phone Number"]
["Medication  - dose 1",null,null,"2 X ES"]

{"sheet":"_Ins","index":7,"n_rows":22,"n_cols":13,"rows_kept":22,"cut":false,"hidden":false,"merged":[[6,1,6,3],[14,1,14,3],[7,1,7,3]]}
[]
["Me"]
["Medical Providers "]
["Insurance Provider"]
["Insurance Log","Insurance Provider"]
[]
["Insurance Carrier: ","Company"]
["Address: ","Address "]
["Phone: ","999-999-9999"]
["Fax: ","999-999-9999"]
[]
["ID No: ","ID number"]
["Group No: ","Group Number"]
[]
["Case Worker: ","Case worker name"]
["Phone: ","999-999-9999"]
["Fax: ","999-999-9999"]
[]
[]
[null,"Insurance Log"]
["LOG DATE","MEDICAL PROVIDER","INVOICE NO","INV DATE","DATE OF SVC","AMOUNT","AMOUNT DUE","EOB","EOB PAID","AMOUNT DIFF","SPOKE TO","PHONE","COMMENT"]
[null,null,null,null,null,null,null,null,null,{"$f":"F22-I22","v":0}]

{"sheet":"_Questions","index":8,"n_rows":206,"n_cols":12,"rows_kept":206,"cut":false,"hidden":false,"merged":[]}
[null,"Questions to Ask"]
[]
[]
[null,null,null,null,null,null,null,null,null,null,null,"ASK"]
[null,null,null,null,null,null,null,null,null,null,null,"y"]
["ASK","ANS","TYPE","QUESTIONS"]
["y",null,"Treatment","What are the possible immediate and long-term side effects of the therapy?"]
["y","y","Treatment","Does the disease require prompt treatment and why?"]
["y",null,"Treatment","Can the disease be cured?"]
[null,null,"Treatment","What are my treatment choices?  What are the pros and cons of each?"]
["y",null,"Treatment","Are new treatments under study that are appropriate for me? "]
[null,null,"Treatment","Would a clinical trial be appropriate for me? "]
[null,null,"Treatment","Which treatment do you recommend? Why?"]
["y",null,"Treatment","What is the goal of this treatment? Cure? Management?"]
[null,null,"Treatment","What are the chances that the treatment will be successful?"]
["y",null,"Treatment","How long will the treatment last? "]
[null,null,"Treatment","How easy is it to administer, and will it disrupt my normal life?"]
[null,null,"Treatment","How durable is the response to treatment likely to be?"]
[null,null,"Treatment","Does the treatment you recommend provide a chance for cure?"]
[null,null,"Treatment","Does this treatment limit the use of treatments I may need later on?"]
[null,null,"Treatment","What toxicity and/or risks are associated with the treatment?"]
[null,null,"Treatment","Will I be able to work during treatment?"]
[null,null,"Treatment","What tests will be used to measure or gauge response to treatment?"]
[null,null,"Treatment","What signs will indicate that the therapy is starting to work or that it is not working?"]
[null,null,"Treatment","What other treatment options do I have?"]
[null,null,"Treatment","Concerning any preexisting conditions:  How will you adjust treatment and monitor me given these circumstances."]
[null,null,"Treatment","What foods, supplements, procedures, or medications should I avoid during treatment?"]
[null,null,"Tests","What tests will you order? What do they measure?"]
[null,null,"Side Effects","What side effects should I expect?  And what side effects should I report to you?"]
[null,null,"Side Effects","What signs or changes should I report immediately?"]
[null,null,"Side Effects","How will I feel during therapy, and will it affect my normal activities?"]
[null,null,"Side Effects","What can I do to minimize risks during therapy?"]
[null,null,"Side Effects","Will you prescribe medications to minimize side effects and risks?  Neupogen? Anti-nausea? etc."]
[null,null,"Side Effects","What side effects may I experience that are not dangerous?"]
[null,null,"Resources?","Can you refer me to a social worker who specializes in helping with finances and insurance matters?"]
[null,null,"Resources?","What resources are available to me to help me cope with the anxiety I feel?"]
[null,null,"Resources?","What other resources are available to me: nutrition? psychosocial? sexual? "]
[null,null,"Prepare","Plan ahead and write down the questions you want to ask.  "]
[null,null,"Prepare","Ask a friend or relative to come with you for support and to hear the responses to your questions."]
[null,null,"Prepare","Bring a tape recorder so you can replay the discussion after you get home."]
[null,null,"Insurance","Prior to treatment or tests: Ask the staff to verify that your doctors, the healthcare facility , and the type of treatment or test you are receiving are all covered in your insurance plan, and check if the tests and treatments require pre-authorization."]
[null,null,"Insurance","Prior to treatment, verify that your doctors, the healthcare facility , and treatments you will receive are all covered by your insurance plan."]
[null,null,"Insurance","Is my insurance likely to cover those expenses?"]
[null,null,"Drug","What prescriptions do I need & how should they be taken and stored?"]
[null,null,"Diagnosis","What materials or resources can you provide to help me to become informed about the disease?"]
[null,null,"Diagnosis","What is my diagnosis? And can you please provide me a copy of the pathology report."]
[null,null,"Diagnosis","How widespread is the disease? "]
[null,null,"Diagnosis","What are the symptoms of the disease, and which indicate a need for treatment?"]
[null,null,"Costs","What are the charges likely to be?"]
[null,null,"Cost","What is the treatment likely to cost?"]
[null,null,"Communication","What is the best way and time to communicate with you about my concerns (phone? fax? email?)"]
[null,null,"Communication","How can I best contact you when this happens?"]
[null,null,"Clinical Trial","Before deciding to participate in a clinical trial, you should know as much as possible about the study. It is important for you to feel very comfortable asking questions, and the staff should answer them in a way that you can easily understand."]
[null,null,"Clinical Trial","Why is this research being done?"]
[null,null,"Clinical Trial","What is the purpose of the study?"]
[null,null,"Clinical Trial","Who is sponsoring the study?"]
[null,null,"Clinical Trial","Who has reviewed and approved this study?"]
[null,null,"Clinical Trial","Why does the research team think the treatment, drug, or medical device will work?"]
[null,null,"Clinical Trial","Where is the study site?"]
[null,null,"Clinical Trial","What kinds of therapies, procedures, and/or tests will I have during the trial?"]
[null,null,"Clinical Trial","Will they hurt? If so, for how long?"]
[null,null,"Clinical Trial","How will the tests in the study compare to tests I would have outside the study?"]
[null,null,"Clinical Trial","How long will the study last?"]
[null,null,"Clinical Trial","How often will I have to go to the study site?"]
[null,null,"Clinical Trial","Who will provide my medical care after the study ends?"]
[null,null,"Clinical Trial","Will I be able to take my regular medications during the trial?"]
[null,null,"Clinical Trial","What medications, procedures, or treatments must I avoid while in the study?"]
[null,null,"Clinical Trial","What are my responsibilities during the study?"]
[null,null,"Clinical Trial","Will I have to be in the hospital during the study?"]
[null,null,"Clinical Trial","Will the study researchers work with my doctor while I am in the study?"]
[null,null,"Clinical Trial","Can anyone find out that I am participating in a study?"]
[null,null,"Clinical Trial","Can I talk to other people in the study?"]
[null,null,"Clinical Trial","Will I be able to find out the results of the trial?"]
[null,null,"Clinical Trial","Will I have to pay anything to participate in the study?"]
[null,null,"Clinical Trial","How do the possible risks and benefits of the study compare with approved treatments for me?"]
[null,null,"General","Can you provide me with copies of the tests?"]
[null,null,"Insurance","Ask the staff to verify that your doctors, the healthcare facility , and the tests you will receive are all covered in your insurance plan, and check if the tests require pre-authorization."]
[null,null,"Tests","How often should I receive these tests?"]
[null,null,"Tests","What changes or symptoms may indicate the need for tests?"]
[null,null,"Tests","What alternatives are there to CT scans for monitoring disease?"]
[null,null,"Tests","When is a bone marrow biopsy indicated?  And what steps can you take to minimize discomfort and anxiety associated with this test?"]
[null,null,"Tests","What test results indicate a need to initiate or change treatment?"]
[]
[]
[]
[]
[]
[]
[]
[]
[]
[]
[]
[]
[]
[]
[]
[]
[]
[]
[]
[]
[]
[]
[]
[]
[]
[]
[]
[]
[]
[]
[]
[]
[]
[]
[]
[]
[]
[]
[]
[]
[]
[]
[]
[]
[]
[]
[]
[]
[]
[]
[]
[]
[]
[]
[]
[]
[]
[]
[]
[]
[]
[]
[]
[]
[]
[]
[]
[]
[]
[]
[]
[]
[]
[]
[]
[]
[]
[]
[]
[]
[]
[]
[]
[]
[]
[]
[]
[]
[]
[]
[]
[]
[]
[]
[]
[]
[]
[]
[]
[]
[]
[]
[]
[]
[]
[]
[]
[]
[]
[]
[]
[]
[]
[]
[]
[]
[]
["ASK","ANS","TYPE","QUESTIONS"]
["y",null,"Treatment","What are the possible immediate and long-term side effects of the therapy?"]
["y","y","Treatment","Does the disease require prompt treatment and why?"]
["y",null,"Treatment","Can the disease be cured?"]
["y",null,"Treatment","Are new treatments under study that are appropriate for me? "]
["y",null,"Treatment","What is the goal of this treatment? Cure? Management?"]
["y",null,"Treatment","How long will the treatment last? "]

{"sheet":"_Checklist","index":9,"n_rows":16,"n_cols":5,"rows_kept":16,"cut":false,"hidden":false,"merged":[]}
[null,null,"CheckList"]
["Journal"]
["Questions",null,null,""]
[null,null,null,null,"add Print button and Show = Y button."]
[]
["Show (y)","Type","Date","Description","Comment"]
["y","Immunization","2004-09-01","Flu shot?"]
[null,"Immunization",null,"Other immunization?"]
[null,"Immunization",null,"Pneumonia shot"]
["y","Visit",null,"Athorization for procedure, tests, or treatment","Get Authorization number and post to Journal"]
["y","Visit",null,"Journals items to show doctor"]
["y","Visit",null,"Medications list"]
["y","Visit",null,"Pathology report"]
["y","Visit",null,"Referral from Primary Care Doctor"]
["y","Visit",null,"Supplements list"]
["y","Visit",null,"Treatment History"]

{"sheet":"Allergy_log","index":10,"n_rows":26,"n_cols":14,"rows_kept":26,"cut":false,"hidden":false,"merged":[[1,3,1,12]]}
[null,null,null,"Allergy log - triggers and responses"]
[]
["Triggers","Yes (Y)","Type","Runny nose","Scratchy throat","Hives","Itching","Rash","Face/Neck swelling","Facial color","Abdominal pain or cramping","Constipation","Diarrhea","Difficulty breathing"]
["Anesthetics (types)",null,"Medication"]
["Antibiotics (specify here)","y","Medication"]
["Beer",null,"food"]
["Cats",null,"Environment"]
["Cleaning products",null,"Environment"]
["Dogs",null,"Environment"]
["Dust",null,"Environment"]
["Eggs",null,"food"]
["Fruit juices (with dyes)",null,"food"]
["Grasses",null,"Environment"]
["Insects",null,"Environment"]
["Latex",null,"Environment"]
["Milk products",null,"food"]
["Mold",null,"Environment"]
["Other",null,"food"]
["Other alcohol",null,"food"]
["Pain medications (types)",null,"Medication"]
["Peanuts",null,"food"]
["Pollen",null,"Environment"]
["Shellfish",null,"food"]
["Soy",null,"food"]
["Trees",null,"Environment"]
["Wheat",null,"food"]

{"sheet":"_Foods","index":11,"n_rows":73,"n_cols":4,"rows_kept":73,"cut":false,"hidden":false,"merged":[]}
[null,null,null,"Food List for the Immune Suppressed"]
[null,null,null,"Adapted from \"Nutrition Guidelines - Diet Guidelines for Immunosuppressed Patients - \nFred Hutchison Cancer Center (for patients undergoing or recovering from stem cell transplants."]
[]
[null,"Type","Avoid / OK","Food"]
[null,"Beverage","Avoid","Un-pasteurized fruit ciders"]
[null,"Beverage","Avoid","Well water (unless tested yearly and found safe)"]
[null,"Beverage","OK","All canned, bottled, powdered beverages "]
[null,"Beverage","OK","Brewed herb teas "]
[null,"Beverage","OK","Commercial bottled distilled, spring and natural waters"]
[null,"Beverage","OK","Instant and brewed coffee, tea "]
[null,"Beverage","OK","Tap water - if from a validated city water service"]
[null,"Breads & Grains","Avoid","Raw grain products"]
[null,"Breads & Grains","Avoid","Unrefrigerated, cream-filled pastry products "]
[null,"Breads & Grains","OK","All breads, bagels, rolls, chips, crackers, muffins, pancakes,  popcorn, sweet rolls, waffles "]
[null,"Breads & Grains","OK","Cooked and canned legumes: lentils, split peas "]
[null,"Breads & Grains","OK","Cooked and dry ready-to-eat cereals "]
[null,"Breads & Grains","OK","Cooked pasta, rice, and other grains "]
[null,"Dairy","Avoid","Cheeses containing chili peppers or uncooked vegetables "]
[null,"Dairy","Avoid","Cheeses with molds, including: blue, Stilton, Roquefort, Gorgonzola"]
[null,"Dairy","Avoid","Sharp cheddar, brie, camembert, feta cheese, farmers cheese"]
[null,"Dairy","Avoid","Un-pasteurized or raw milk products, including yogurts "]
[null,"Dairy","OK","All pasteurized milk and milk products, including cheese"]
[null,"Dairy","OK","Commercial nutritional supplements and baby formulas - liquid and powdered"]
[null,"Dairy","OK","Dry, refrigerated and frozen pasteurized whipped topping Ice cream, frozen yogurt "]
[null,"Dairy","OK","Non-dairy pasteurized cream products "]
[null,"Dairy","OK","Sherbet ice cream bars, milkshakes "]
[null,"Dairy","OK","Yogurt (\"pasteurized\" stated on label), "]
[null,"Dessert","Avoid","Un-refrigerated cream-filled pastries,  cakes, cookies, and pies"]
[null,"Fats","Avoid","(e.g., blue, Roquefort) kept in refrigerated  case in store"]
[null,"Fats","Avoid","Fresh salad dressings containing aged cheese  "]
[null,"Fats","OK","Oil, shortening,  lard, margarine and butter -  refrigerated after opening "]
[null,"Fruit & Nuts","Avoid","Commercial salsas stored in refrigerated case of store"]
[null,"Fruit & Nuts","Avoid","Salads from delicatessens"]
[null,"Fruit & Nuts","Avoid","Un-roasted, raw nuts, nuts in a shell"]
[null,"Fruit & Nuts","Avoid","Unwashed raw fruits, "]
[null,"Fruit & Nuts","Avoid","Unwashed raw vegetables"]
[null,"Fruit & Nuts","OK","Canned and frozen fruits and fruit juices "]
[null,"Fruit & Nuts","OK","Canned or bottled roasted nuts"]
[null,"Fruit & Nuts","OK","Dried fruits "]
[null,"Fruit & Nuts","OK","Nuts in baked products "]
[null,"Fruit & Nuts","OK","Well washed raw fruit "]
[null,"Meat","Avoid","Cold smoked salmon, lox (or other fish) "]
[null,"Meat","Avoid","Fish shell fish ham bacon sausage eggs hot dogs"]
[null,"Meat","Avoid","Pickled fish"]
[null,"Meat","Avoid","Raw or undercooked meats: "]
[null,"Meat","OK","All well cooked meats:  poultry, fish, shellfish, ham, bacon,  sausage and hot dogs"]
[null,"Meat","OK","Commercial packaged salami, bologna, other luncheon meats. Hard smoked fish, refrigerated after opening.  NOTE: Before eating these products it is recommended that you thoroughly reheat untill steaming."]
[null,"Meat","OK","Pasteurized egg substitutes (e.g., Egg Beaters)"]
[null,"Meat","OK","Well cooked eggs (white cooked firm with thickened yolk is acceptable)"]
[null,"Other","Avoid","All miso products (e.g., miso soup)"]
[null,"Other","Avoid","Brewers yeast, if eaten uncooked. "]
[null,"Other","Avoid","Herbal and non-traditional (health food store) nutrient supplements"]
[null,"Other","Avoid","Raw or un-pasteurized honey "]
[null,"Refrig Cond.","OK","catsup, mustard, BBQ sauce, "]
[null,"Refrig Cond.","OK","Commercial shelf-stable mayonnaise and salad dressings  (including Roquefort, Blue cheese dressings) - when  refrigerated  after opening"]
[null,"Refrig Cond.","OK","Condiments refrigerated after opening, including"]
[null,"Refrig Cond.","OK","Jams, jelly, syrups - refrigerated after opening"]
[null,"Refrig Cond.","OK","Olives, pickles, relish Soy sauce,"]
[null,"Refrig Cond.","OK","Pasteurized honey "]
[null,"Refrig Cond.","OK","Salt and granulated sugars, brown sugar"]
[null,"Refrig Cond.","OK","Soups "]
[null,"Refrig Cond.","OK","Vinegar candy, gum"]
[null,"Refrig Desserts","OK","Homemade and commercial cookies"]
[null,"Refrig Desserts","OK","Refrigerated commercial or homemade cakes, pies, pastries and pudding "]
[null,"Refrig Desserts","OK","Shelf-stable cookies, cream-filled cupcakes, fruit pies, pastries, pop tarts and puddings, Ices, popsicle-like products"]
[null,"Veg","Avoid","Commercial salsas stored in refrigerated case of store"]
[null,"Veg","Avoid","Salads from delicatessens "]
[null,"Veg","Avoid","Unwashed raw vegetables "]
[null,"Veg","OK","All canned and frozen vegetables and potatoes. "]
[null,"Veg","OK","Bottled and canned salsa, refrigerated after opening"]
[null,"Veg","OK","Cooked fresh vegetables.  "]
[null,"Veg","OK","Dried herbs and spices (may be added during or after cooking and to raw foods) "]
[null,"Veg","OK","Well washed raw vegetables and fresh herbs. "]

{"sheet":"_Diary","index":12,"n_rows":10,"n_cols":5,"rows_kept":10,"cut":false,"hidden":false,"merged":[]}
[null,null,null,null,"My Journal"]
["Checklist"]
["Questions"]
[]
[]
[]
["Show (y)","Alert (x)","Date","Type","Description"]
["y","x","2003-01-01","Pain","Unexplained pain in shoulder - not related to treatment"]
[null,"x","2004-02-01","Side effect","Started in AM"]
[null,null,null,"Imaging","CT scans -  neck"]

{"sheet":"_Overview","index":13,"n_rows":4,"n_cols":2,"rows_kept":4,"cut":false,"hidden":false,"merged":[]}
[]
[]
[]
[null,"MY LABS OVERVIEW"]

{"sheet":"_Performance","index":14,"n_rows":24,"n_cols":3,"rows_kept":24,"cut":false,"hidden":false,"merged":[[17,1,17,2],[4,1,4,2],[0,1,0,2],[3,0,3,1]]}
[null,"Performance Scales"]
[]
[]
["Peformance factor"]
[null,"Karnofsky performance scale"]
[null,"STATUS","MEANING"]
[null,1,"No symptoms."]
[null,0.9,"Able to carry on normal activity; minor signs or symptoms of disease."]
[null,0.8,"Able to carry on normal activity with effort; some signs or symptoms of disease."]
[null,0.7,"Cares for self, unable to carry on normal activity or do active work."]
[null,0.6,"Requires occasional assistance but is able to care for most of own needs."]
[null,0.5,"Requires considerable assistance and frequent medical care."]
[null,0.4,"Disabled; requires special care and assistance."]
[null,0.3,"Severely disabled; hospitalization indicated, although death not imminent."]
[null,0.2,"Very ill; hospitalization necessary; active supportive treatment required."]
[null,0.1,"Moribund, fatal processes progressing rapidly."]
[]
[null,"Eastern Cooperative Oncology Group (ECOG)"]
[null,"GRADE","DESCRIPTION"]
[null,0,"Fully active, able to carry on all pre-disease performance without restriction"]
[null,1,"Restricted in physically strenuous activity but ambulatory (can walk) and able to carry out work of a light or sedentary (sitting) nature, e.g., light house work, office work"]
[null,2,"Ambulatory and capable of all self care but unable to carry out any work activities. Up and about more than 50% of waking hours"]
[null,3,"Capable of only limited self care, confined to bed or chair more than 50% of waking hours"]
[null,4,"Completely disabled. Cannot carry on any selfcare. Totally confined to bed or chair"]

{"sheet":"_Glossary","index":15,"n_rows":17,"n_cols":4,"rows_kept":17,"cut":false,"hidden":false,"merged":[]}
[]
[null,"GLOSSARY"]
["Lab Setup"]
[null,"Term","Type","Description"]
[null,"White Blood Cell Count (WBC differential) Leukocytes","blood","A high WBC usually means that the body is fighting an infection. A very low WBC can be caused by problems with the bone marrow. This condition, called cytopenia or leukopenia, means that your body is less able to fight off infections."]
[null,"Differential","blood","The differential is a breakdown of the different types of white blood cells, also called leukocytes. There are actually two main types of white blood cells: phagocytes and lymphocytes. Phagocytes attack germs directly and are powerful defenses against certain infections. Lymphocytes, which include T-cells, B-cells, and NK cells are involved in adaptive immunity. ."]
[null,"Neutrophils","blood","Neutrophils fight bacterial infections. They normally account for 55% to 70% of WBCs. If you have a very low count, referred to as neutropenia, you could get a bacterial infection. Lymphomas can cause neutropenia, as can treatments. (55 - 70% of WBCs)"]
[null,"Lymphocytes","blood","There are two main types of lymphocytes: T-cells that attack and kill germs and help regulate the immune system, and B-cells that make antibodies -special proteins that attack pathogens (germs). Lymphocytes are normally 20% to 40% of WBCs. "]
[null,"Monocytes","blood","Monocytes fight infections by gobbling up pathogens (such as germs) and signaling to other immune cells when pathogens are found. Monocytes circulate in the blood. A high count usually means you are fighting a bacterial infection. Monocytes make up 2 - 8% of WBCs."]
[null,"Eosinophils","blood","Eosinophils are associated with response to  allergens and reactions to parasites. Eosinophils are normally 1% to 4% of WBCs. "]
[null,"Basophils","blood","Basophils are associated with allergic reactions. They are usually less than 1% of WBCs. "]
[null,"Bilirubin","Lab","Liver enzyme"]
[null,"Erythrocytes","blood","Erythrocytes are red blood cells.  They make up the largest population of blood cells, numbering from 4.5 million to 6 million per cubic millimeter (m/mm3) of blood. Erythrocytes help exchange oxygen and carbon dioxide between the lungs and  body tissues. RBC (X106/uL) (Red blood cells) Low levels cause anemia and associated fatigue (Normal: 4.7 - 6.1 )\n "]
[null,"Hemoglobin ","blood","Red blood pigment. A hemoglobin test measures the total amount of hemoglobin in the blood. A deficiency of iron and therefore of hemoglobin leads to anemia and poor oxygenation of the body tissues. Hgb (g/dL) "]
[null,"Hematocrit","blood","Percent of whole blood that is comprised of red blood cells. It is a measure of both the number of red blood cells, and the size of red blood cells."]
[null,"Complete Metabolic Profile","serum test","A series of tests performed on serum. It analyzes a variety of components in the serum including glucose, liver enzymes, bilirubin, calcium, potassium,chloride, protein,and albumin. It may also include cholesterol and triglycerides (CMP with Lipids). \n\nCan be used by your doctor to confirm a suspected disease, follow the course of a chronic disease, determine the effect of therapy or screen for potential health problems during a routine physical exam. "]
[null,"Platelets","blood","Platelets are necessary for normal blood clotting. Most important, they clump together (aggregate) to repair small holes in damaged blood vessels.  "]

{"sheet":"_CBC","index":16,"n_rows":84,"n_cols":5,"rows_kept":84,"cut":false,"hidden":false,"merged":[[66,1,67,1],[66,2,67,2],[66,3,67,3],[66,4,67,4],[68,1,72,1],[2,1,2,4],[3,1,3,4],[11,1,15,1],[17,1,21,1],[5,1,9,1],[23,1,27,1],[29,1,33,1],[64,3,65,3],[64,4,65,4],[61,2,62,2],[61,3,62,3],[61,4,62,4],[35,1,36,1],[64,2,65,2],[57,1,58,1],[64,1,65,1],[60,1,62,1],[38,1,43,1],[51,1,55,1],[45,1,49,1]]}
[]
[]
[null,"Peripheral Blood Reference Ranges "]
[null,"Adapted from University of Washington Medical Center\n= indicates same as Male"]
[null,"Red Blood Count (RBC)","Age","Male","Female"]
[null,"(X106/uL)\n(Erythrocytes)\nLow levels cause anemia and fatigue","6 mo - 2 yr","3.70 - 5.30","3.70 - 5.30"]
[null,null,"2 yr - 6 yr","3.90 - 5.30","3.90 - 5.30"]
[null,null,"6 yr - 12 yr","4.00 - 5.20","4.00 - 5.20"]
[null,null,"12 yr - 18 yr","4.50 - 5.30","4.10 - 5.10"]
[null,null,"18 yr +","4.40 - 5.60","3.80 - 5.00"]
[null,"Hemoglobin (Hgb)","Age","Male","Female"]
[null,"(g/dL)\n(Red blood pigment)\nDeficiency of iron and therefore of hemoglobin leads to anemia and decreased ability to carry  oxygen to body tissues","6 mo -2 yr","10.5 -13.5","10.5 - 13.5"]
[null,null,"2 yr - 6 yr","11.5  - 13.5","11.5 - 13.5"]
[null,null,"6 yr - 12 yr","11.5  - 15.5","11.5 - 15.5"]
[null,null,"12 yr - 18 yr","13.0  - 15.5","12.0 - 15.5"]
[null,null,"18 yr +","13.0  - 18.0","11.5 - 15.5"]
[null,"Hematocrit (Hct)","Age","Male","Female"]
[null,"(%)\nPercent of whole blood that is comprised of red blood cells; measure of both the number and  size of red blood cells.","6 mo - 2 yr","33  - 39","33 - 39"]
[null,null,"2 yr -6 yr","34 - 40","34 - 40"]
[null,null,"6 yr -12 yr","35 - 45","35 - 45"]
[null,null,"12 yr -18 yr","37 - 49","36 - 45"]
[null,null,"18 yr +","38 - 50","36 - 45"]
[null,"Mean Corpuscular Volume","Age","Male","Female"]
[null,"MCV (fL)\nMeasures the size of \nred blood cells.\nLarger or smaller than normal red blood cells may indicate anemia.","6 mo -2 yr","70 - 86","="]
[null,null,"2 yr - 6 yr","75 - 87","="]
[null,null,"6 yr - 12 yr","77 - 95","="]
[null,null,"12 yr - 18 yr","81 - 98","="]
[null,null,"18 yr +","81 - 98","="]
[null,"Mean Corpuscular Hemoglobin (MCH)","Age","Male","Female"]
[null,"MCH (pg)\nEstimate of the amount of hemoglobin in the average red cell. Low levels indicate anemia","6 mo - 2 yr","23.0 - 31.0","="]
[null,null,"2 yr - 6 yr","24.0 - 30.0","="]
[null,null,"6 yr  -12 yr","25.0 - 33.0","="]
[null,null,"12 yr - 18 yr","25.0 - 35.0","="]
[null,null,"18 yr +","27.3 - 33.6","="]
[null,"Mean Corpuscular Hemoglobin Concentration (MCHC)","Age","Male","Female"]
[null,"(g/dL)\nEstimate of the amount of hemoglobin in the average red cell. Low levels indicate anemia","6M - 2 yr","30.0 - 36.0","="]
[null,null,"2 yr +","32.3 - 35.7","="]
[null,"Platelets (Thrombocytes)","Age","Male","Female"]
[null,"  (X103/uL)\nHelp your to blood clot in order to stop bleeding from injury. Decreased platelet count is called thrombocytopenia.","0 – 1 mo","250 - 450","="]
[null,null,"1 mo - 1 yr","300 - 750","="]
[null,null,"1  yr - 3 yr","250 - 600","="]
[null,null,"3 yr - 7 yr","250 - 550","="]
[null,null,"7 yr - 12 yr","200 - 450","="]
[null,null,"12 yr +","150 - 400","="]
[null,"White Blood Count (WBC)","Age","Male","Female"]
[null,"(x 103/uL)\nLow levels associated with risk of infection; high levels indicates possible infection.","6 mo - 2 yrs","6.0 - 17.0","="]
[null,null,"2 yr - 4 yrs","6.0 - 15.5","="]
[null,null,"4 yr  - 6 yr","5.5 - 14.5","="]
[null,null,"6 yr - 14 yr","4.5 - 13.5","="]
[null,null,"14 yr +","4.3 - 10.0","="]
[null,"Neutrophils","Age","Male","Female"]
[null,"(X103/uL)\nThese cells provide primary defense against bacterial infection. Range: 50-70% of White Blood Cells\nBands: 2-6% of White Blood Cells","6 mo - 1 yr","1.50 - 5.00","="]
[null,null,"1 yr  - 4 yr ","1.50 - 5.00","="]
[null,null,"4 yr - 10 yr","1.50 - 7.50","="]
[null,null,"10 yr - 12 yr","1.80 - 7.00","="]
[null,null,"12 yr +","1.80 - 7.00","="]
[null,"Monocytes","Age","Male","Female"]
[null,"(X103/uL)\nGerm eating cells. A low number can increase risk of getting sick from an infection, particularly of bacteria type. ","6M-1 yr","0 - 0.60","="]
[null,null,"1 yr +","0 - 0.80","="]
[null,"Eosinophils","Age","Male","Female"]
[null,"(X103/uL)\nA  type of phagocyte that produces the anti-inflammatory protein histamine.","6 mo - 1 yr","0 - 0.80","="]
[null,null,"1 yr +","0 - 0.50","="]
[]
[null,"Basophils","Age","Male","Female"]
[null,"(X103/uL)\nControl inflammation and damage of tissues in the body.","6 mo +","0 - 0.20","="]
[]
[null,"Lymphocytes","Age","Male","Female"]
[]
[null," (X103/uL)\nMany kinds of immune cells; protect against pathogens (bacteria, virus, fungi) and cancer.","6 mo - 1 yr","3.00 - 7.00","="]
[null,null,"1 yr - 4  yr","1.50 - 8.50","="]
[null,null,"4 yr - 10 yr","1.50 - 5.00","="]
[null,null,"10 yr - 12 yr","1.20 - 5.00","="]
[null,null,"12 yr +","1.00 - 4.80","="]
[null,"Lymphocyte information:\n(Adapted from Family \nPractice Notebook)","Age","Male","Female"]
[null,"ABS T cell - CD4",null,"0.350 - 1.334","="]
[null,"ABS T cell - CD8",null,"0.147 - 0.812","="]
[null,"T-cell ratio  CD4 / CD8",null,"0.84 - 3.05","="]
[null,"Total T Lymphocytes",null,"800-2200 / mmü","="]
[null,"T helper Cells",null,">400 / mmü","="]
[null,"T suppressors",null,"250 – 750 / mmü","="]
[null,"Ratio Helper cells  to Suppressor cells",null,">0.9","="]
[null,"% Lymphocytes of White Blood Cells",null,"15-40%","="]
[null,"% CD2 of lymphocytes",null,"65-85%","="]
[null,"% CD4 of lymphocytes:",null,"45-75%","="]

{"sheet":"_1","index":17,"n_rows":53,"n_cols":7,"rows_kept":53,"cut":false,"hidden":false,"merged":[]}
[null,"Date",null,"Lab 1","Lab 2","Lab 3","Lab 4"]
[null,"2017-01-01",null,"Lab 5","Lab 6","Lab 7","Lab 8"]
["Lab Setup","Lab Measures",null,"Lab 9","Lab 10","Lab 11","Lab 12"]
["Lab Report","Lab Plot"]
["TYPE","TEST NAME","RESULT","H/L","UNITS","L","H"]
[{"$f":"_Setup!A8","v":"Complete Metabolic Profile"},{"$f":"_Setup!B8","v":"ALP (Alkaline Phosphatase)"},30,{"$f":"IF(ISBLANK(C6),\" \",IF(C6<F6,\"L\",IF(C6>G6,\"H\",\" \")))","v":" "},{"$f":"_Setup!C8","v":"IU/L"},{"$f":"_Setup!D8","v":30},{"$f":"_Setup!E8","v":130}]
[{"$f":"_Setup!A9","v":" "},{"$f":"_Setup!B9","v":"ALT (amino alanine transferase)"},null,{"$f":"IF(ISBLANK(C7),\" \",IF(C7<F7,\"L\",IF(C7>G7,\"H\",\" \")))","v":" "},{"$f":"_Setup!C9","v":"IU/L"},{"$f":"_Setup!D9","v":5},{"$f":"_Setup!E9","v":40}]
[{"$f":"_Setup!A10","v":" "},{"$f":"_Setup!B10","v":"AST (aspartate aminotransferase)"},null," ",{"$f":"_Setup!C10","v":"IU/L"},{"$f":"_Setup!D10","v":10},{"$f":"_Setup!E10","v":45}]
[{"$f":"_Setup!A11","v":" "},{"$f":"_Setup!B11","v":"Albumin, serum (Alb)"},null," ",{"$f":"_Setup!C11","v":"gm/dL "},{"$f":"_Setup!D11","v":3.5},{"$f":"_Setup!E11","v":5}]
[{"$f":"_Setup!A12","v":" "},{"$f":"_Setup!B12","v":"Bilirubin, Total (Bili), serum"},null," ",{"$f":"_Setup!C12","v":"mg/dL"},{"$f":"_Setup!D12","v":0.2},{"$f":"_Setup!E12","v":1}]
[{"$f":"_Setup!A13","v":" "},{"$f":"_Setup!B13","v":"BUN (Blood urea nitrogen)"},12," ",{"$f":"_Setup!C13","v":"mg/dL"},{"$f":"_Setup!D13","v":8},{"$f":"_Setup!E13","v":18}]
[{"$f":"_Setup!A14","v":" "},{"$f":"_Setup!B14","v":"Ca - Calcium"},null," ",{"$f":"_Setup!C14","v":"mg/dL"},{"$f":"_Setup!D14","v":8.5},{"$f":"_Setup!E14","v":10.5}]
[{"$f":"_Setup!A15","v":" "},{"$f":"_Setup!B15","v":"CI - Chloride"},null," ",{"$f":"_Setup!C15","v":"mEq/L"},{"$f":"_Setup!D15","v":97},{"$f":"_Setup!E15","v":107}]
[{"$f":"_Setup!A16","v":" "},{"$f":"_Setup!B16","v":"CO2 - Carbon dioxide"},null," ",{"$f":"_Setup!C16","v":"mEq/L"},{"$f":"_Setup!D16","v":20},{"$f":"_Setup!E16","v":29}]
[{"$f":"_Setup!A17","v":" "},{"$f":"_Setup!B17","v":"CRT - Creatinine"},null," ",{"$f":"_Setup!C17","v":"mg/dL"},{"$f":"_Setup!D17","v":0.6},{"$f":"_Setup!E17","v":1.5}]
[{"$f":"_Setup!A18","v":" "},{"$f":"_Setup!B18","v":"Glucose"},null," ",{"$f":"_Setup!C18","v":"mg/dL"},{"$f":"_Setup!D18","v":65},{"$f":"_Setup!E18","v":110}]
[{"$f":"_Setup!A19","v":" "},{"$f":"_Setup!B19","v":"Mg - Magnesium"},null," ",{"$f":"_Setup!C19","v":"mg/dL"},{"$f":"_Setup!D19","v":1.8},{"$f":"_Setup!E19","v":2.5}]
[{"$f":"_Setup!A20","v":" "},{"$f":"_Setup!B20","v":"Potassium (K)"},null," ",{"$f":"_Setup!C20","v":"mEq/L"},{"$f":"_Setup!D20","v":3.5},{"$f":"_Setup!E20","v":5}]
[{"$f":"_Setup!A21","v":" "},{"$f":"_Setup!B21","v":"Sodium (Na)"},null," ",{"$f":"_Setup!C21","v":"mEq/L"},{"$f":"_Setup!D21","v":135},{"$f":"_Setup!E21","v":145}]
[{"$f":"_Setup!A22","v":" "},{"$f":"_Setup!B22","v":"Total Protein"},null," ",{"$f":"_Setup!C22","v":"gm/dL "},{"$f":"_Setup!D22","v":6},{"$f":"_Setup!E22","v":8}]
[{"$f":"_Setup!A23","v":"CBC"},{"$f":"_Setup!B23","v":"RBC - Red Blood Cells"},null," ",{"$f":"_Setup!C23","v":"(X106/uL)"},{"$f":"_Setup!D23","v":4.4000000000000004},{"$f":"_Setup!E23","v":5.6}]
[{"$f":"_Setup!A24","v":" "},{"$f":"_Setup!B24","v":"Hgb - Hemoglobin"},null," ",{"$f":"_Setup!C24","v":"(g/dL)"},{"$f":"_Setup!D24","v":13},{"$f":"_Setup!E24","v":18}]
[{"$f":"_Setup!A25","v":" "},{"$f":"_Setup!B25","v":"Hct - Hematocrtit"},null," ",{"$f":"_Setup!C25","v":"%"},{"$f":"_Setup!D25","v":0.38},{"$f":"_Setup!E25","v":0.5}]
[{"$f":"_Setup!A26","v":" "},{"$f":"_Setup!B26","v":"MCV - Mean Corp. Volume"},null," ",{"$f":"_Setup!C26","v":"(fL)"},{"$f":"_Setup!D26","v":81},{"$f":"_Setup!E26","v":98}]
[{"$f":"_Setup!A27","v":" "},{"$f":"_Setup!B27","v":"MCH - Mean Corp. Hgb"},null," ",{"$f":"_Setup!C27","v":"(pg)"},{"$f":"_Setup!D27","v":27.3},{"$f":"_Setup!E27","v":33.6}]
[{"$f":"_Setup!A28","v":" "},{"$f":"_Setup!B28","v":"MCHC - Mean Corp. Hgb Concentration"},null," ",{"$f":"_Setup!C28","v":"(g/dL)"},{"$f":"_Setup!D28","v":32.299999999999997},{"$f":"_Setup!E28","v":35.700000000000003}]
[{"$f":"_Setup!A29","v":" "},{"$f":"_Setup!B29","v":"RDW - Red cell Dist Width"},null," ",{"$f":"_Setup!C29","v":"%"},{"$f":"_Setup!D29","v":0.11799999999999999},{"$f":"_Setup!E29","v":0.14099999999999999}]
[{"$f":"_Setup!A30","v":" "},{"$f":"_Setup!B30","v":"ESR - Erythrocyte Sedimentation Rate"},null," ",{"$f":"_Setup!C30","v":"mm/hr"},{"$f":"_Setup!D30","v":0.01},{"$f":"_Setup!E30","v":20}]
[{"$f":"_Setup!A31","v":" "},{"$f":"_Setup!B31","v":"Platelets (Thrombocytes)"},null," ",{"$f":"_Setup!C31","v":"(X103/uL)"},{"$f":"_Setup!D31","v":150},{"$f":"_Setup!E31","v":400}]
[{"$f":"_Setup!A31","v":" "},{"$f":"_Setup!B32","v":"WBC - White blood cells"},null," ",{"$f":"_Setup!C32","v":"(X103/uL)"},{"$f":"_Setup!D32","v":4.3},{"$f":"_Setup!E32","v":10}]
[{"$f":"_Setup!A32","v":" "},{"$f":"_Setup!B33","v":"Basophils"},null,{"$f":"IF(ISBLANK(C31),\" \",IF(C31<F31,\"L\",IF(C31>G31,\"H\",\" \")))","v":" "},{"$f":"_Setup!C33","v":"(X103/uL)"},{"$f":"_Setup!D33","v":0.01},{"$f":"_Setup!E33","v":0.2}]
[{"$f":"_Setup!A33","v":" "},{"$f":"_Setup!B34","v":"Eosinophils"},null,{"$f":"IF(ISBLANK(C32),\" \",IF(C32<F32,\"L\",IF(C32>G32,\"H\",\" \")))","v":" "},{"$f":"_Setup!C34","v":"(X103/uL)"},{"$f":"_Setup!D34","v":0.01},{"$f":"_Setup!E34","v":0.5}]
[{"$f":"_Setup!A34","v":" "},{"$f":"_Setup!B35","v":"Monocytes"},null," ",{"$f":"_Setup!C35","v":"(X103/uL)"},{"$f":"_Setup!D35","v":0.01},{"$f":"_Setup!E35","v":0.8}]
[{"$f":"_Setup!A35","v":" "},{"$f":"_Setup!B36","v":"Total Neutrophils"},null," ",{"$f":"_Setup!C36","v":"%"},{"$f":"_Setup!D36","v":38},{"$f":"_Setup!E36","v":80}]
[{"$f":"_Setup!A36","v":"Differential"},{"$f":"_Setup!B37","v":"Total Neutrophils, Absolute (ANC)"},null," ",{"$f":"_Setup!C37","v":"Cells/Cu.Mm"},{"$f":"_Setup!D37","v":1650},{"$f":"_Setup!E37","v":8000}]
[{"$f":"_Setup!A37","v":" "},{"$f":"_Setup!B38","v":"Total Lymphocytes"},null," ",{"$f":"_Setup!C38","v":"%"},{"$f":"_Setup!D38","v":15},{"$f":"_Setup!E38","v":49}]
[{"$f":"_Setup!A38","v":" "},{"$f":"_Setup!B39","v":"Total Lymphocytes, Absolute"},null," ",{"$f":"_Setup!C39","v":"Cells/Cu.Mm"},{"$f":"_Setup!D39","v":1000},{"$f":"_Setup!E39","v":3500}]
[{"$f":"_Setup!A39","v":" "},{"$f":"_Setup!B40","v":"Monocytes"},null," ",{"$f":"_Setup!C40","v":"%"},{"$f":"_Setup!D40","v":0.01},{"$f":"_Setup!E40","v":13}]
[{"$f":"_Setup!A40","v":" "},{"$f":"_Setup!B41","v":"Monocytes, Absolute "},null," ",{"$f":"_Setup!C41","v":"Cells/Cu.Mm"},{"$f":"_Setup!D41","v":40},{"$f":"_Setup!E41","v":900}]
[{"$f":"_Setup!A41","v":" "},{"$f":"_Setup!B42","v":"Basophils"},null," ",{"$f":"_Setup!C42","v":"%"},{"$f":"_Setup!D42","v":0.01},{"$f":"_Setup!E42","v":2}]
[{"$f":"_Setup!A42","v":" "},{"$f":"_Setup!B43","v":"Basophils, Absolute"},null," ",{"$f":"_Setup!C43","v":"Cells/Cu.Mm"},{"$f":"_Setup!D43","v":0.01},{"$f":"_Setup!E43","v":125}]
[{"$f":"_Setup!A43","v":" "},{"$f":"_Setup!B44","v":"Eosinophils"},null," ",{"$f":"_Setup!C44","v":"%"},{"$f":"_Setup!D44","v":0.01},{"$f":"_Setup!E44","v":8}]
[{"$f":"_Setup!A44","v":" "},{"$f":"_Setup!B45","v":"Eosinophils, Absolute"},null," ",{"$f":"_Setup!C45","v":"Cells/Cu.Mm"},{"$f":"_Setup!D45","v":30},{"$f":"_Setup!E45","v":600}]
[{"$f":"_Setup!A45","v":" "},{"$f":"_Setup!B46","v":"Cholesterol, total"},null," ",{"$f":"_Setup!C46","v":"mg/dL"},{"$f":"_Setup!D46","v":130},{"$f":"_Setup!E46","v":200}]
[{"$f":"_Setup!A46","v":"Lipids"},{"$f":"_Setup!B47","v":"Triglycerides"},null," ",{"$f":"_Setup!C47","v":"mg/dL"},{"$f":"_Setup!D47","v":10},{"$f":"_Setup!E47","v":150}]
[{"$f":"_Setup!A47","v":" "},{"$f":"_Setup!B48","v":"Lactate dehydrogenase (LDH)"},null," ",{"$f":"_Setup!C48","v":" u/l "},{"$f":"_Setup!D48","v":100},{"$f":"_Setup!E48","v":190}]
[{"$f":"_Setup!A48","v":"Markers"},{"$f":"_Setup!B49","v":"Beta-2 Microglobulin (B2M)"},null," ",{"$f":"_Setup!C49","v":"g/ml"},{"$f":"_Setup!D49","v":0.01},{"$f":"_Setup!E49","v":2.5}]
[{"$f":"_Setup!A49","v":" "},{"$f":"_Setup!B50","v":"Uric acid"},null," ",{"$f":"_Setup!C50","v":"mg/dL"},{"$f":"_Setup!D50","v":2.5},{"$f":"_Setup!E50","v":8}]
[{"$f":"_Setup!A50","v":" "},{"$f":"_Setup!B51","v":"Urine Albumin /  Albumin/Creatinine Ratio"},null," ",{"$f":"_Setup!C51","v":0},{"$f":"_Setup!D51","v":0},{"$f":"_Setup!E51","v":0}]
[{"$f":"_Setup!A51","v":"Custom"},{"$f":"_Setup!B52","v":"eGFR"},null," ",{"$f":"_Setup!C52","v":"mL/min/1.73m"},{"$f":"_Setup!D52","v":60},{"$f":"_Setup!E52","v":100}]
[{"$f":"_Setup!A52","v":" "},{"$f":"_Setup!B53","v":"cystatin C "},null," ",{"$f":"_Setup!C53","v":0},{"$f":"_Setup!D53","v":0},{"$f":"_Setup!E53","v":0}]
[{"$f":"_Setup!A53","v":" "},{"$f":"_Setup!B54","v":"Custom 4"},null," ",{"$f":"_Setup!C54","v":0},{"$f":"_Setup!D54","v":0},{"$f":"_Setup!E54","v":0}]
[{"$f":"_Setup!A54","v":" "},{"$f":"_Setup!B55","v":"Custom 5"},null," ",{"$f":"_Setup!C55","v":0},{"$f":"_Setup!D55","v":0},{"$f":"_Setup!E55","v":0}]

{"sheet":"_2","index":18,"n_rows":53,"n_cols":7,"rows_kept":53,"cut":false,"hidden":false,"merged":[]}
[null,"Date",null,"Lab 1","Lab 2","Lab 3","Lab 4"]
[null,null,null,"Lab 5","Lab 6","Lab 7","Lab 8"]
["Lab Setup","Lab Measures",null,"Lab 9","Lab 10","Lab 11","Lab 12"]
["Lab Report","Lab Plot"]
["TYPE","TEST NAME","RESULT","H/L","UNITS","L","H"]
[{"$f":"_Setup!A8","v":"Complete Metabolic Profile"},{"$f":"_Setup!B8","v":"ALP (Alkaline Phosphatase)"},33,{"$f":"IF(ISBLANK(C6),\" \",IF(C6<F6,\"L\",IF(C6>G6,\"H\",\" \")))","v":" "},{"$f":"_Setup!C8","v":"IU/L"},{"$f":"_Setup!D8","v":30},{"$f":"_Setup!E8","v":130}]
[{"$f":"_Setup!A9","v":" "},{"$f":"_Setup!B9","v":"ALT (amino alanine transferase)"},null,{"$f":"IF(ISBLANK(C7),\" \",IF(C7<F7,\"L\",IF(C7>G7,\"H\",\" \")))","v":" "},{"$f":"_Setup!C9","v":"IU/L"},{"$f":"_Setup!D9","v":5},{"$f":"_Setup!E9","v":40}]
[null,{"$f":"_Setup!B10","v":"AST (aspartate aminotransferase)"},null," ",{"$f":"_Setup!C10","v":"IU/L"},{"$f":"_Setup!D10","v":10},{"$f":"_Setup!E10","v":45}]
["Sample numbers",{"$f":"_Setup!B11","v":"Albumin, serum (Alb)"},null," ",{"$f":"_Setup!C11","v":"gm/dL "},{"$f":"_Setup!D11","v":3.5},{"$f":"_Setup!E11","v":5}]
[{"$f":"_Setup!A12","v":" "},{"$f":"_Setup!B12","v":"Bilirubin, Total (Bili), serum"},null," ",{"$f":"_Setup!C12","v":"mg/dL"},{"$f":"_Setup!D12","v":0.2},{"$f":"_Setup!E12","v":1}]
[{"$f":"_Setup!A13","v":" "},{"$f":"_Setup!B13","v":"BUN (Blood urea nitrogen)"},14," ",{"$f":"_Setup!C13","v":"mg/dL"},{"$f":"_Setup!D13","v":8},{"$f":"_Setup!E13","v":18}]
[{"$f":"_Setup!A14","v":" "},{"$f":"_Setup!B14","v":"Ca - Calcium"},null," ",{"$f":"_Setup!C14","v":"mg/dL"},{"$f":"_Setup!D14","v":8.5},{"$f":"_Setup!E14","v":10.5}]
[{"$f":"_Setup!A15","v":" "},{"$f":"_Setup!B15","v":"CI - Chloride"},null," ",{"$f":"_Setup!C15","v":"mEq/L"},{"$f":"_Setup!D15","v":97},{"$f":"_Setup!E15","v":107}]
[{"$f":"_Setup!A16","v":" "},{"$f":"_Setup!B16","v":"CO2 - Carbon dioxide"},null," ",{"$f":"_Setup!C16","v":"mEq/L"},{"$f":"_Setup!D16","v":20},{"$f":"_Setup!E16","v":29}]
[{"$f":"_Setup!A17","v":" "},{"$f":"_Setup!B17","v":"CRT - Creatinine"},null," ",{"$f":"_Setup!C17","v":"mg/dL"},{"$f":"_Setup!D17","v":0.6},{"$f":"_Setup!E17","v":1.5}]
[{"$f":"_Setup!A18","v":" "},{"$f":"_Setup!B18","v":"Glucose"},null," ",{"$f":"_Setup!C18","v":"mg/dL"},{"$f":"_Setup!D18","v":65},{"$f":"_Setup!E18","v":110}]
[{"$f":"_Setup!A19","v":" "},{"$f":"_Setup!B19","v":"Mg - Magnesium"},null," ",{"$f":"_Setup!C19","v":"mg/dL"},{"$f":"_Setup!D19","v":1.8},{"$f":"_Setup!E19","v":2.5}]
[{"$f":"_Setup!A20","v":" "},{"$f":"_Setup!B20","v":"Potassium (K)"},null," ",{"$f":"_Setup!C20","v":"mEq/L"},{"$f":"_Setup!D20","v":3.5},{"$f":"_Setup!E20","v":5}]
[{"$f":"_Setup!A21","v":" "},{"$f":"_Setup!B21","v":"Sodium (Na)"},null," ",{"$f":"_Setup!C21","v":"mEq/L"},{"$f":"_Setup!D21","v":135},{"$f":"_Setup!E21","v":145}]
[{"$f":"_Setup!A22","v":" "},{"$f":"_Setup!B22","v":"Total Protein"},null," ",{"$f":"_Setup!C22","v":"gm/dL "},{"$f":"_Setup!D22","v":6},{"$f":"_Setup!E22","v":8}]
[{"$f":"_Setup!A23","v":"CBC"},{"$f":"_Setup!B23","v":"RBC - Red Blood Cells"},null," ",{"$f":"_Setup!C23","v":"(X106/uL)"},{"$f":"_Setup!D23","v":4.4000000000000004},{"$f":"_Setup!E23","v":5.6}]
[{"$f":"_Setup!A24","v":" "},{"$f":"_Setup!B24","v":"Hgb - Hemoglobin"},null," ",{"$f":"_Setup!C24","v":"(g/dL)"},{"$f":"_Setup!D24","v":13},{"$f":"_Setup!E24","v":18}]
[{"$f":"_Setup!A25","v":" "},{"$f":"_Setup!B25","v":"Hct - Hematocrtit"},null," ",{"$f":"_Setup!C25","v":"%"},{"$f":"_Setup!D25","v":0.38},{"$f":"_Setup!E25","v":0.5}]
[{"$f":"_Setup!A26","v":" "},{"$f":"_Setup!B26","v":"MCV - Mean Corp. Volume"},null," ",{"$f":"_Setup!C26","v":"(fL)"},{"$f":"_Setup!D26","v":81},{"$f":"_Setup!E26","v":98}]
[{"$f":"_Setup!A27","v":" "},{"$f":"_Setup!B27","v":"MCH - Mean Corp. Hgb"},null," ",{"$f":"_Setup!C27","v":"(pg)"},{"$f":"_Setup!D27","v":27.3},{"$f":"_Setup!E27","v":33.6}]
[{"$f":"_Setup!A28","v":" "},{"$f":"_Setup!B28","v":"MCHC - Mean Corp. Hgb Concentration"},null," ",{"$f":"_Setup!C28","v":"(g/dL)"},{"$f":"_Setup!D28","v":32.299999999999997},{"$f":"_Setup!E28","v":35.700000000000003}]
[{"$f":"_Setup!A29","v":" "},{"$f":"_Setup!B29","v":"RDW - Red cell Dist Width"},null," ",{"$f":"_Setup!C29","v":"%"},{"$f":"_Setup!D29","v":0.11799999999999999},{"$f":"_Setup!E29","v":0.14099999999999999}]
[{"$f":"_Setup!A30","v":" "},{"$f":"_Setup!B30","v":"ESR - Erythrocyte Sedimentation Rate"},null," ",{"$f":"_Setup!C30","v":"mm/hr"},{"$f":"_Setup!D30","v":0.01},{"$f":"_Setup!E30","v":20}]
[{"$f":"_Setup!A31","v":" "},{"$f":"_Setup!B31","v":"Platelets (Thrombocytes)"},null," ",{"$f":"_Setup!C31","v":"(X103/uL)"},{"$f":"_Setup!D31","v":150},{"$f":"_Setup!E31","v":400}]
[{"$f":"_Setup!A31","v":" "},{"$f":"_Setup!B32","v":"WBC - White blood cells"},null," ",{"$f":"_Setup!C32","v":"(X103/uL)"},{"$f":"_Setup!D32","v":4.3},{"$f":"_Setup!E32","v":10}]
[{"$f":"_Setup!A32","v":" "},{"$f":"_Setup!B33","v":"Basophils"},null,{"$f":"IF(ISBLANK(C31),\" \",IF(C31<F31,\"L\",IF(C31>G31,\"H\",\" \")))","v":" "},{"$f":"_Setup!C33","v":"(X103/uL)"},{"$f":"_Setup!D33","v":0.01},{"$f":"_Setup!E33","v":0.2}]
[{"$f":"_Setup!A33","v":" "},{"$f":"_Setup!B34","v":"Eosinophils"},null,{"$f":"IF(ISBLANK(C32),\" \",IF(C32<F32,\"L\",IF(C32>G32,\"H\",\" \")))","v":" "},{"$f":"_Setup!C34","v":"(X103/uL)"},{"$f":"_Setup!D34","v":0.01},{"$f":"_Setup!E34","v":0.5}]
[{"$f":"_Setup!A34","v":" "},{"$f":"_Setup!B35","v":"Monocytes"},null," ",{"$f":"_Setup!C35","v":"(X103/uL)"},{"$f":"_Setup!D35","v":0.01},{"$f":"_Setup!E35","v":0.8}]
[{"$f":"_Setup!A35","v":" "},{"$f":"_Setup!B36","v":"Total Neutrophils"},null," ",{"$f":"_Setup!C36","v":"%"},{"$f":"_Setup!D36","v":38},{"$f":"_Setup!E36","v":80}]
[{"$f":"_Setup!A36","v":"Differential"},{"$f":"_Setup!B37","v":"Total Neutrophils, Absolute (ANC)"},null," ",{"$f":"_Setup!C37","v":"Cells/Cu.Mm"},{"$f":"_Setup!D37","v":1650},{"$f":"_Setup!E37","v":8000}]
[{"$f":"_Setup!A37","v":" "},{"$f":"_Setup!B38","v":"Total Lymphocytes"},null," ",{"$f":"_Setup!C38","v":"%"},{"$f":"_Setup!D38","v":15},{"$f":"_Setup!E38","v":49}]
[{"$f":"_Setup!A38","v":" "},{"$f":"_Setup!B39","v":"Total Lymphocytes, Absolute"},null," ",{"$f":"_Setup!C39","v":"Cells/Cu.Mm"},{"$f":"_Setup!D39","v":1000},{"$f":"_Setup!E39","v":3500}]
[{"$f":"_Setup!A39","v":" "},{"$f":"_Setup!B40","v":"Monocytes"},null," ",{"$f":"_Setup!C40","v":"%"},{"$f":"_Setup!D40","v":0.01},{"$f":"_Setup!E40","v":13}]
[{"$f":"_Setup!A40","v":" "},{"$f":"_Setup!B41","v":"Monocytes, Absolute "},null," ",{"$f":"_Setup!C41","v":"Cells/Cu.Mm"},{"$f":"_Setup!D41","v":40},{"$f":"_Setup!E41","v":900}]
[{"$f":"_Setup!A41","v":" "},{"$f":"_Setup!B42","v":"Basophils"},null," ",{"$f":"_Setup!C42","v":"%"},{"$f":"_Setup!D42","v":0.01},{"$f":"_Setup!E42","v":2}]
[{"$f":"_Setup!A42","v":" "},{"$f":"_Setup!B43","v":"Basophils, Absolute"},null," ",{"$f":"_Setup!C43","v":"Cells/Cu.Mm"},{"$f":"_Setup!D43","v":0.01},{"$f":"_Setup!E43","v":125}]
[{"$f":"_Setup!A43","v":" "},{"$f":"_Setup!B44","v":"Eosinophils"},null," ",{"$f":"_Setup!C44","v":"%"},{"$f":"_Setup!D44","v":0.01},{"$f":"_Setup!E44","v":8}]
[{"$f":"_Setup!A44","v":" "},{"$f":"_Setup!B45","v":"Eosinophils, Absolute"},null," ",{"$f":"_Setup!C45","v":"Cells/Cu.Mm"},{"$f":"_Setup!D45","v":30},{"$f":"_Setup!E45","v":600}]
[{"$f":"_Setup!A45","v":" "},{"$f":"_Setup!B46","v":"Cholesterol, total"},null," ",{"$f":"_Setup!C46","v":"mg/dL"},{"$f":"_Setup!D46","v":130},{"$f":"_Setup!E46","v":200}]
[{"$f":"_Setup!A46","v":"Lipids"},{"$f":"_Setup!B47","v":"Triglycerides"},null," ",{"$f":"_Setup!C47","v":"mg/dL"},{"$f":"_Setup!D47","v":10},{"$f":"_Setup!E47","v":150}]
[{"$f":"_Setup!A47","v":" "},{"$f":"_Setup!B48","v":"Lactate dehydrogenase (LDH)"},null," ",{"$f":"_Setup!C48","v":" u/l "},{"$f":"_Setup!D48","v":100},{"$f":"_Setup!E48","v":190}]
[{"$f":"_Setup!A48","v":"Markers"},{"$f":"_Setup!B49","v":"Beta-2 Microglobulin (B2M)"},null," ",{"$f":"_Setup!C49","v":"g/ml"},{"$f":"_Setup!D49","v":0.01},{"$f":"_Setup!E49","v":2.5}]
[{"$f":"_Setup!A49","v":" "},{"$f":"_Setup!B50","v":"Uric acid"},null," ",{"$f":"_Setup!C50","v":"mg/dL"},{"$f":"_Setup!D50","v":2.5},{"$f":"_Setup!E50","v":8}]
[{"$f":"_Setup!A50","v":" "},{"$f":"_Setup!B51","v":"Urine Albumin /  Albumin/Creatinine Ratio"},null," ",{"$f":"_Setup!C51","v":0},{"$f":"_Setup!D51","v":0},{"$f":"_Setup!E51","v":0}]
[{"$f":"_Setup!A51","v":"Custom"},{"$f":"_Setup!B52","v":"eGFR"},null," ",{"$f":"_Setup!C52","v":"mL/min/1.73m"},{"$f":"_Setup!D52","v":60},{"$f":"_Setup!E52","v":100}]
[{"$f":"_Setup!A52","v":" "},{"$f":"_Setup!B53","v":"cystatin C "},null," ",{"$f":"_Setup!C53","v":0},{"$f":"_Setup!D53","v":0},{"$f":"_Setup!E53","v":0}]
[{"$f":"_Setup!A53","v":" "},{"$f":"_Setup!B54","v":"Custom 4"},null," ",{"$f":"_Setup!C54","v":0},{"$f":"_Setup!D54","v":0},{"$f":"_Setup!E54","v":0}]
[{"$f":"_Setup!A54","v":" "},{"$f":"_Setup!B55","v":"Custom 5"},null," ",{"$f":"_Setup!C55","v":0},{"$f":"_Setup!D55","v":0},{"$f":"_Setup!E55","v":0}]

{"sheet":"_3","index":19,"n_rows":53,"n_cols":7,"rows_kept":53,"cut":false,"hidden":false,"merged":[]}
[null,"Date",null,"Lab 1","Lab 2","Lab 3","Lab 4"]
[null,null,null,"Lab 5","Lab 6","Lab 7","Lab 8"]
["Lab Setup","Lab Measures",null,"Lab 9","Lab 10","Lab 11","Lab 12"]
["Lab Report","Lab Plot"]
["TYPE","TEST NAME","RESULT","H/L","UNITS","L","H"]
[{"$f":"_Setup!A8","v":"Complete Metabolic Profile"},{"$f":"_Setup!B8","v":"ALP (Alkaline Phosphatase)"},22,{"$f":"IF(ISBLANK(C6),\" \",IF(C6<F6,\"L\",IF(C6>G6,\"H\",\" \")))","v":"L"},{"$f":"_Setup!C8","v":"IU/L"},{"$f":"_Setup!D8","v":30},{"$f":"_Setup!E8","v":130}]
[{"$f":"_Setup!A9","v":" "},{"$f":"_Setup!B9","v":"ALT (amino alanine transferase)"},null,{"$f":"IF(ISBLANK(C7),\" \",IF(C7<F7,\"L\",IF(C7>G7,\"H\",\" \")))","v":" "},{"$f":"_Setup!C9","v":"IU/L"},{"$f":"_Setup!D9","v":5},{"$f":"_Setup!E9","v":40}]
[{"$f":"_Setup!A10","v":" "},{"$f":"_Setup!B10","v":"AST (aspartate aminotransferase)"},null," ",{"$f":"_Setup!C10","v":"IU/L"},{"$f":"_Setup!D10","v":10},{"$f":"_Setup!E10","v":45}]
[{"$f":"_Setup!A11","v":" "},{"$f":"_Setup!B11","v":"Albumin, serum (Alb)"},null," ",{"$f":"_Setup!C11","v":"gm/dL "},{"$f":"_Setup!D11","v":3.5},{"$f":"_Setup!E11","v":5}]
[{"$f":"_Setup!A12","v":" "},{"$f":"_Setup!B12","v":"Bilirubin, Total (Bili), serum"},null," ",{"$f":"_Setup!C12","v":"mg/dL"},{"$f":"_Setup!D12","v":0.2},{"$f":"_Setup!E12","v":1}]
[{"$f":"_Setup!A13","v":" "},{"$f":"_Setup!B13","v":"BUN (Blood urea nitrogen)"},16," ",{"$f":"_Setup!C13","v":"mg/dL"},{"$f":"_Setup!D13","v":8},{"$f":"_Setup!E13","v":18}]
[{"$f":"_Setup!A14","v":" "},{"$f":"_Setup!B14","v":"Ca - Calcium"},null," ",{"$f":"_Setup!C14","v":"mg/dL"},{"$f":"_Setup!D14","v":8.5},{"$f":"_Setup!E14","v":10.5}]
[{"$f":"_Setup!A15","v":" "},{"$f":"_Setup!B15","v":"CI - Chloride"},null," ",{"$f":"_Setup!C15","v":"mEq/L"},{"$f":"_Setup!D15","v":97},{"$f":"_Setup!E15","v":107}]
[{"$f":"_Setup!A16","v":" "},{"$f":"_Setup!B16","v":"CO2 - Carbon dioxide"},null," ",{"$f":"_Setup!C16","v":"mEq/L"},{"$f":"_Setup!D16","v":20},{"$f":"_Setup!E16","v":29}]
[{"$f":"_Setup!A17","v":" "},{"$f":"_Setup!B17","v":"CRT - Creatinine"},null," ",{"$f":"_Setup!C17","v":"mg/dL"},{"$f":"_Setup!D17","v":0.6},{"$f":"_Setup!E17","v":1.5}]
[{"$f":"_Setup!A18","v":" "},{"$f":"_Setup!B18","v":"Glucose"},null," ",{"$f":"_Setup!C18","v":"mg/dL"},{"$f":"_Setup!D18","v":65},{"$f":"_Setup!E18","v":110}]
[{"$f":"_Setup!A19","v":" "},{"$f":"_Setup!B19","v":"Mg - Magnesium"},null," ",{"$f":"_Setup!C19","v":"mg/dL"},{"$f":"_Setup!D19","v":1.8},{"$f":"_Setup!E19","v":2.5}]
[{"$f":"_Setup!A20","v":" "},{"$f":"_Setup!B20","v":"Potassium (K)"},null," ",{"$f":"_Setup!C20","v":"mEq/L"},{"$f":"_Setup!D20","v":3.5},{"$f":"_Setup!E20","v":5}]
[{"$f":"_Setup!A21","v":" "},{"$f":"_Setup!B21","v":"Sodium (Na)"},null," ",{"$f":"_Setup!C21","v":"mEq/L"},{"$f":"_Setup!D21","v":135},{"$f":"_Setup!E21","v":145}]
[{"$f":"_Setup!A22","v":" "},{"$f":"_Setup!B22","v":"Total Protein"},null," ",{"$f":"_Setup!C22","v":"gm/dL "},{"$f":"_Setup!D22","v":6},{"$f":"_Setup!E22","v":8}]
[{"$f":"_Setup!A23","v":"CBC"},{"$f":"_Setup!B23","v":"RBC - Red Blood Cells"},null," ",{"$f":"_Setup!C23","v":"(X106/uL)"},{"$f":"_Setup!D23","v":4.4000000000000004},{"$f":"_Setup!E23","v":5.6}]
[{"$f":"_Setup!A24","v":" "},{"$f":"_Setup!B24","v":"Hgb - Hemoglobin"},null," ",{"$f":"_Setup!C24","v":"(g/dL)"},{"$f":"_Setup!D24","v":13},{"$f":"_Setup!E24","v":18}]
[{"$f":"_Setup!A25","v":" "},{"$f":"_Setup!B25","v":"Hct - Hematocrtit"},null," ",{"$f":"_Setup!C25","v":"%"},{"$f":"_Setup!D25","v":0.38},{"$f":"_Setup!E25","v":0.5}]
[{"$f":"_Setup!A26","v":" "},{"$f":"_Setup!B26","v":"MCV - Mean Corp. Volume"},null," ",{"$f":"_Setup!C26","v":"(fL)"},{"$f":"_Setup!D26","v":81},{"$f":"_Setup!E26","v":98}]
[{"$f":"_Setup!A27","v":" "},{"$f":"_Setup!B27","v":"MCH - Mean Corp. Hgb"},null," ",{"$f":"_Setup!C27","v":"(pg)"},{"$f":"_Setup!D27","v":27.3},{"$f":"_Setup!E27","v":33.6}]
[{"$f":"_Setup!A28","v":" "},{"$f":"_Setup!B28","v":"MCHC - Mean Corp. Hgb Concentration"},null," ",{"$f":"_Setup!C28","v":"(g/dL)"},{"$f":"_Setup!D28","v":32.299999999999997},{"$f":"_Setup!E28","v":35.700000000000003}]
[{"$f":"_Setup!A29","v":" "},{"$f":"_Setup!B29","v":"RDW - Red cell Dist Width"},null," ",{"$f":"_Setup!C29","v":"%"},{"$f":"_Setup!D29","v":0.11799999999999999},{"$f":"_Setup!E29","v":0.14099999999999999}]
[{"$f":"_Setup!A30","v":" "},{"$f":"_Setup!B30","v":"ESR - Erythrocyte Sedimentation Rate"},null," ",{"$f":"_Setup!C30","v":"mm/hr"},{"$f":"_Setup!D30","v":0.01},{"$f":"_Setup!E30","v":20}]
[{"$f":"_Setup!A31","v":" "},{"$f":"_Setup!B31","v":"Platelets (Thrombocytes)"},null," ",{"$f":"_Setup!C31","v":"(X103/uL)"},{"$f":"_Setup!D31","v":150},{"$f":"_Setup!E31","v":400}]
[{"$f":"_Setup!A31","v":" "},{"$f":"_Setup!B32","v":"WBC - White blood cells"},null," ",{"$f":"_Setup!C32","v":"(X103/uL)"},{"$f":"_Setup!D32","v":4.3},{"$f":"_Setup!E32","v":10}]
[{"$f":"_Setup!A32","v":" "},{"$f":"_Setup!B33","v":"Basophils"},null,{"$f":"IF(ISBLANK(C31),\" \",IF(C31<F31,\"L\",IF(C31>G31,\"H\",\" \")))","v":" "},{"$f":"_Setup!C33","v":"(X103/uL)"},{"$f":"_Setup!D33","v":0.01},{"$f":"_Setup!E33","v":0.2}]
[{"$f":"_Setup!A33","v":" "},{"$f":"_Setup!B34","v":"Eosinophils"},null,{"$f":"IF(ISBLANK(C32),\" \",IF(C32<F32,\"L\",IF(C32>G32,\"H\",\" \")))","v":" "},{"$f":"_Setup!C34","v":"(X103/uL)"},{"$f":"_Setup!D34","v":0.01},{"$f":"_Setup!E34","v":0.5}]
[{"$f":"_Setup!A34","v":" "},{"$f":"_Setup!B35","v":"Monocytes"},null," ",{"$f":"_Setup!C35","v":"(X103/uL)"},{"$f":"_Setup!D35","v":0.01},{"$f":"_Setup!E35","v":0.8}]
[{"$f":"_Setup!A35","v":" "},{"$f":"_Setup!B36","v":"Total Neutrophils"},null," ",{"$f":"_Setup!C36","v":"%"},{"$f":"_Setup!D36","v":38},{"$f":"_Setup!E36","v":80}]
[{"$f":"_Setup!A36","v":"Differential"},{"$f":"_Setup!B37","v":"Total Neutrophils, Absolute (ANC)"},null," ",{"$f":"_Setup!C37","v":"Cells/Cu.Mm"},{"$f":"_Setup!D37","v":1650},{"$f":"_Setup!E37","v":8000}]
[{"$f":"_Setup!A37","v":" "},{"$f":"_Setup!B38","v":"Total Lymphocytes"},null," ",{"$f":"_Setup!C38","v":"%"},{"$f":"_Setup!D38","v":15},{"$f":"_Setup!E38","v":49}]
[{"$f":"_Setup!A38","v":" "},{"$f":"_Setup!B39","v":"Total Lymphocytes, Absolute"},null," ",{"$f":"_Setup!C39","v":"Cells/Cu.Mm"},{"$f":"_Setup!D39","v":1000},{"$f":"_Setup!E39","v":3500}]
[{"$f":"_Setup!A39","v":" "},{"$f":"_Setup!B40","v":"Monocytes"},null," ",{"$f":"_Setup!C40","v":"%"},{"$f":"_Setup!D40","v":0.01},{"$f":"_Setup!E40","v":13}]
[{"$f":"_Setup!A40","v":" "},{"$f":"_Setup!B41","v":"Monocytes, Absolute "},null," ",{"$f":"_Setup!C41","v":"Cells/Cu.Mm"},{"$f":"_Setup!D41","v":40},{"$f":"_Setup!E41","v":900}]
[{"$f":"_Setup!A41","v":" "},{"$f":"_Setup!B42","v":"Basophils"},null," ",{"$f":"_Setup!C42","v":"%"},{"$f":"_Setup!D42","v":0.01},{"$f":"_Setup!E42","v":2}]
[{"$f":"_Setup!A42","v":" "},{"$f":"_Setup!B43","v":"Basophils, Absolute"},null," ",{"$f":"_Setup!C43","v":"Cells/Cu.Mm"},{"$f":"_Setup!D43","v":0.01},{"$f":"_Setup!E43","v":125}]
[{"$f":"_Setup!A43","v":" "},{"$f":"_Setup!B44","v":"Eosinophils"},null," ",{"$f":"_Setup!C44","v":"%"},{"$f":"_Setup!D44","v":0.01},{"$f":"_Setup!E44","v":8}]
[{"$f":"_Setup!A44","v":" "},{"$f":"_Setup!B45","v":"Eosinophils, Absolute"},null," ",{"$f":"_Setup!C45","v":"Cells/Cu.Mm"},{"$f":"_Setup!D45","v":30},{"$f":"_Setup!E45","v":600}]
[{"$f":"_Setup!A45","v":" "},{"$f":"_Setup!B46","v":"Cholesterol, total"},null," ",{"$f":"_Setup!C46","v":"mg/dL"},{"$f":"_Setup!D46","v":130},{"$f":"_Setup!E46","v":200}]
[{"$f":"_Setup!A46","v":"Lipids"},{"$f":"_Setup!B47","v":"Triglycerides"},null," ",{"$f":"_Setup!C47","v":"mg/dL"},{"$f":"_Setup!D47","v":10},{"$f":"_Setup!E47","v":150}]
[{"$f":"_Setup!A47","v":" "},{"$f":"_Setup!B48","v":"Lactate dehydrogenase (LDH)"},null," ",{"$f":"_Setup!C48","v":" u/l "},{"$f":"_Setup!D48","v":100},{"$f":"_Setup!E48","v":190}]
[{"$f":"_Setup!A48","v":"Markers"},{"$f":"_Setup!B49","v":"Beta-2 Microglobulin (B2M)"},null," ",{"$f":"_Setup!C49","v":"g/ml"},{"$f":"_Setup!D49","v":0.01},{"$f":"_Setup!E49","v":2.5}]
[{"$f":"_Setup!A49","v":" "},{"$f":"_Setup!B50","v":"Uric acid"},null," ",{"$f":"_Setup!C50","v":"mg/dL"},{"$f":"_Setup!D50","v":2.5},{"$f":"_Setup!E50","v":8}]
[{"$f":"_Setup!A50","v":" "},{"$f":"_Setup!B51","v":"Urine Albumin /  Albumin/Creatinine Ratio"},null," ",{"$f":"_Setup!C51","v":0},{"$f":"_Setup!D51","v":0},{"$f":"_Setup!E51","v":0}]
[{"$f":"_Setup!A51","v":"Custom"},{"$f":"_Setup!B52","v":"eGFR"},null," ",{"$f":"_Setup!C52","v":"mL/min/1.73m"},{"$f":"_Setup!D52","v":60},{"$f":"_Setup!E52","v":100}]
[{"$f":"_Setup!A52","v":" "},{"$f":"_Setup!B53","v":"cystatin C "},null," ",{"$f":"_Setup!C53","v":0},{"$f":"_Setup!D53","v":0},{"$f":"_Setup!E53","v":0}]
[{"$f":"_Setup!A53","v":" "},{"$f":"_Setup!B54","v":"Custom 4"},null," ",{"$f":"_Setup!C54","v":0},{"$f":"_Setup!D54","v":0},{"$f":"_Setup!E54","v":0}]
[{"$f":"_Setup!A54","v":" "},{"$f":"_Setup!B55","v":"Custom 5"},null," ",{"$f":"_Setup!C55","v":0},{"$f":"_Setup!D55","v":0},{"$f":"_Setup!E55","v":0}]

{"sheet":"_4","index":20,"n_rows":53,"n_cols":7,"rows_kept":53,"cut":false,"hidden":false,"merged":[]}
[null,"Date",null,"Lab 1","Lab 2","Lab 3","Lab 4"]
[null,null,null,"Lab 5","Lab 6","Lab 7","Lab 8"]
["Lab Setup","Lab Measures",null,"Lab 9","Lab 10","Lab 11","Lab 12"]
["Lab Report","Lab Plot"]
["TYPE","TEST NAME","RESULT","H/L","UNITS","L","H"]
[{"$f":"_Setup!A8","v":"Complete Metabolic Profile"},{"$f":"_Setup!B8","v":"ALP (Alkaline Phosphatase)"},22,{"$f":"IF(ISBLANK(C6),\" \",IF(C6<F6,\"L\",IF(C6>G6,\"H\",\" \")))","v":"L"},{"$f":"_Setup!C8","v":"IU/L"},{"$f":"_Setup!D8","v":30},{"$f":"_Setup!E8","v":130}]
[{"$f":"_Setup!A9","v":" "},{"$f":"_Setup!B9","v":"ALT (amino alanine transferase)"},null,{"$f":"IF(ISBLANK(C7),\" \",IF(C7<F7,\"L\",IF(C7>G7,\"H\",\" \")))","v":" "},{"$f":"_Setup!C9","v":"IU/L"},{"$f":"_Setup!D9","v":5},{"$f":"_Setup!E9","v":40}]
[{"$f":"_Setup!A10","v":" "},{"$f":"_Setup!B10","v":"AST (aspartate aminotransferase)"},null," ",{"$f":"_Setup!C10","v":"IU/L"},{"$f":"_Setup!D10","v":10},{"$f":"_Setup!E10","v":45}]
[{"$f":"_Setup!A11","v":" "},{"$f":"_Setup!B11","v":"Albumin, serum (Alb)"},null," ",{"$f":"_Setup!C11","v":"gm/dL "},{"$f":"_Setup!D11","v":3.5},{"$f":"_Setup!E11","v":5}]
[{"$f":"_Setup!A12","v":" "},{"$f":"_Setup!B12","v":"Bilirubin, Total (Bili), serum"},null," ",{"$f":"_Setup!C12","v":"mg/dL"},{"$f":"_Setup!D12","v":0.2},{"$f":"_Setup!E12","v":1}]
[{"$f":"_Setup!A13","v":" "},{"$f":"_Setup!B13","v":"BUN (Blood urea nitrogen)"},18," ",{"$f":"_Setup!C13","v":"mg/dL"},{"$f":"_Setup!D13","v":8},{"$f":"_Setup!E13","v":18}]
[{"$f":"_Setup!A14","v":" "},{"$f":"_Setup!B14","v":"Ca - Calcium"},null," ",{"$f":"_Setup!C14","v":"mg/dL"},{"$f":"_Setup!D14","v":8.5},{"$f":"_Setup!E14","v":10.5}]
[{"$f":"_Setup!A15","v":" "},{"$f":"_Setup!B15","v":"CI - Chloride"},null," ",{"$f":"_Setup!C15","v":"mEq/L"},{"$f":"_Setup!D15","v":97},{"$f":"_Setup!E15","v":107}]
[{"$f":"_Setup!A16","v":" "},{"$f":"_Setup!B16","v":"CO2 - Carbon dioxide"},null," ",{"$f":"_Setup!C16","v":"mEq/L"},{"$f":"_Setup!D16","v":20},{"$f":"_Setup!E16","v":29}]
[{"$f":"_Setup!A17","v":" "},{"$f":"_Setup!B17","v":"CRT - Creatinine"},null," ",{"$f":"_Setup!C17","v":"mg/dL"},{"$f":"_Setup!D17","v":0.6},{"$f":"_Setup!E17","v":1.5}]
[{"$f":"_Setup!A18","v":" "},{"$f":"_Setup!B18","v":"Glucose"},null," ",{"$f":"_Setup!C18","v":"mg/dL"},{"$f":"_Setup!D18","v":65},{"$f":"_Setup!E18","v":110}]
[{"$f":"_Setup!A19","v":" "},{"$f":"_Setup!B19","v":"Mg - Magnesium"},null," ",{"$f":"_Setup!C19","v":"mg/dL"},{"$f":"_Setup!D19","v":1.8},{"$f":"_Setup!E19","v":2.5}]
[{"$f":"_Setup!A20","v":" "},{"$f":"_Setup!B20","v":"Potassium (K)"},null," ",{"$f":"_Setup!C20","v":"mEq/L"},{"$f":"_Setup!D20","v":3.5},{"$f":"_Setup!E20","v":5}]
[{"$f":"_Setup!A21","v":" "},{"$f":"_Setup!B21","v":"Sodium (Na)"},null," ",{"$f":"_Setup!C21","v":"mEq/L"},{"$f":"_Setup!D21","v":135},{"$f":"_Setup!E21","v":145}]
[{"$f":"_Setup!A22","v":" "},{"$f":"_Setup!B22","v":"Total Protein"},null," ",{"$f":"_Setup!C22","v":"gm/dL "},{"$f":"_Setup!D22","v":6},{"$f":"_Setup!E22","v":8}]
[{"$f":"_Setup!A23","v":"CBC"},{"$f":"_Setup!B23","v":"RBC - Red Blood Cells"},null," ",{"$f":"_Setup!C23","v":"(X106/uL)"},{"$f":"_Setup!D23","v":4.4000000000000004},{"$f":"_Setup!E23","v":5.6}]
[{"$f":"_Setup!A24","v":" "},{"$f":"_Setup!B24","v":"Hgb - Hemoglobin"},null," ",{"$f":"_Setup!C24","v":"(g/dL)"},{"$f":"_Setup!D24","v":13},{"$f":"_Setup!E24","v":18}]
[{"$f":"_Setup!A25","v":" "},{"$f":"_Setup!B25","v":"Hct - Hematocrtit"},null," ",{"$f":"_Setup!C25","v":"%"},{"$f":"_Setup!D25","v":0.38},{"$f":"_Setup!E25","v":0.5}]
[{"$f":"_Setup!A26","v":" "},{"$f":"_Setup!B26","v":"MCV - Mean Corp. Volume"},null," ",{"$f":"_Setup!C26","v":"(fL)"},{"$f":"_Setup!D26","v":81},{"$f":"_Setup!E26","v":98}]
[{"$f":"_Setup!A27","v":" "},{"$f":"_Setup!B27","v":"MCH - Mean Corp. Hgb"},null," ",{"$f":"_Setup!C27","v":"(pg)"},{"$f":"_Setup!D27","v":27.3},{"$f":"_Setup!E27","v":33.6}]
[{"$f":"_Setup!A28","v":" "},{"$f":"_Setup!B28","v":"MCHC - Mean Corp. Hgb Concentration"},null," ",{"$f":"_Setup!C28","v":"(g/dL)"},{"$f":"_Setup!D28","v":32.299999999999997},{"$f":"_Setup!E28","v":35.700000000000003}]
[{"$f":"_Setup!A29","v":" "},{"$f":"_Setup!B29","v":"RDW - Red cell Dist Width"},null," ",{"$f":"_Setup!C29","v":"%"},{"$f":"_Setup!D29","v":0.11799999999999999},{"$f":"_Setup!E29","v":0.14099999999999999}]
[{"$f":"_Setup!A30","v":" "},{"$f":"_Setup!B30","v":"ESR - Erythrocyte Sedimentation Rate"},null," ",{"$f":"_Setup!C30","v":"mm/hr"},{"$f":"_Setup!D30","v":0.01},{"$f":"_Setup!E30","v":20}]
[{"$f":"_Setup!A31","v":" "},{"$f":"_Setup!B31","v":"Platelets (Thrombocytes)"},null," ",{"$f":"_Setup!C31","v":"(X103/uL)"},{"$f":"_Setup!D31","v":150},{"$f":"_Setup!E31","v":400}]
[{"$f":"_Setup!A31","v":" "},{"$f":"_Setup!B32","v":"WBC - White blood cells"},null," ",{"$f":"_Setup!C32","v":"(X103/uL)"},{"$f":"_Setup!D32","v":4.3},{"$f":"_Setup!E32","v":10}]
[{"$f":"_Setup!A32","v":" "},{"$f":"_Setup!B33","v":"Basophils"},null,{"$f":"IF(ISBLANK(C31),\" \",IF(C31<F31,\"L\",IF(C31>G31,\"H\",\" \")))","v":" "},{"$f":"_Setup!C33","v":"(X103/uL)"},{"$f":"_Setup!D33","v":0.01},{"$f":"_Setup!E33","v":0.2}]
[{"$f":"_Setup!A33","v":" "},{"$f":"_Setup!B34","v":"Eosinophils"},null,{"$f":"IF(ISBLANK(C32),\" \",IF(C32<F32,\"L\",IF(C32>G32,\"H\",\" \")))","v":" "},{"$f":"_Setup!C34","v":"(X103/uL)"},{"$f":"_Setup!D34","v":0.01},{"$f":"_Setup!E34","v":0.5}]
[{"$f":"_Setup!A34","v":" "},{"$f":"_Setup!B35","v":"Monocytes"},null," ",{"$f":"_Setup!C35","v":"(X103/uL)"},{"$f":"_Setup!D35","v":0.01},{"$f":"_Setup!E35","v":0.8}]
[{"$f":"_Setup!A35","v":" "},{"$f":"_Setup!B36","v":"Total Neutrophils"},null," ",{"$f":"_Setup!C36","v":"%"},{"$f":"_Setup!D36","v":38},{"$f":"_Setup!E36","v":80}]
[{"$f":"_Setup!A36","v":"Differential"},{"$f":"_Setup!B37","v":"Total Neutrophils, Absolute (ANC)"},null," ",{"$f":"_Setup!C37","v":"Cells/Cu.Mm"},{"$f":"_Setup!D37","v":1650},{"$f":"_Setup!E37","v":8000}]
[{"$f":"_Setup!A37","v":" "},{"$f":"_Setup!B38","v":"Total Lymphocytes"},null," ",{"$f":"_Setup!C38","v":"%"},{"$f":"_Setup!D38","v":15},{"$f":"_Setup!E38","v":49}]
[{"$f":"_Setup!A38","v":" "},{"$f":"_Setup!B39","v":"Total Lymphocytes, Absolute"},null," ",{"$f":"_Setup!C39","v":"Cells/Cu.Mm"},{"$f":"_Setup!D39","v":1000},{"$f":"_Setup!E39","v":3500}]
[{"$f":"_Setup!A39","v":" "},{"$f":"_Setup!B40","v":"Monocytes"},null," ",{"$f":"_Setup!C40","v":"%"},{"$f":"_Setup!D40","v":0.01},{"$f":"_Setup!E40","v":13}]
[{"$f":"_Setup!A40","v":" "},{"$f":"_Setup!B41","v":"Monocytes, Absolute "},null," ",{"$f":"_Setup!C41","v":"Cells/Cu.Mm"},{"$f":"_Setup!D41","v":40},{"$f":"_Setup!E41","v":900}]
[{"$f":"_Setup!A41","v":" "},{"$f":"_Setup!B42","v":"Basophils"},null," ",{"$f":"_Setup!C42","v":"%"},{"$f":"_Setup!D42","v":0.01},{"$f":"_Setup!E42","v":2}]
[{"$f":"_Setup!A42","v":" "},{"$f":"_Setup!B43","v":"Basophils, Absolute"},null," ",{"$f":"_Setup!C43","v":"Cells/Cu.Mm"},{"$f":"_Setup!D43","v":0.01},{"$f":"_Setup!E43","v":125}]
[{"$f":"_Setup!A43","v":" "},{"$f":"_Setup!B44","v":"Eosinophils"},null," ",{"$f":"_Setup!C44","v":"%"},{"$f":"_Setup!D44","v":0.01},{"$f":"_Setup!E44","v":8}]
[{"$f":"_Setup!A44","v":" "},{"$f":"_Setup!B45","v":"Eosinophils, Absolute"},null," ",{"$f":"_Setup!C45","v":"Cells/Cu.Mm"},{"$f":"_Setup!D45","v":30},{"$f":"_Setup!E45","v":600}]
[{"$f":"_Setup!A45","v":" "},{"$f":"_Setup!B46","v":"Cholesterol, total"},null," ",{"$f":"_Setup!C46","v":"mg/dL"},{"$f":"_Setup!D46","v":130},{"$f":"_Setup!E46","v":200}]
[{"$f":"_Setup!A46","v":"Lipids"},{"$f":"_Setup!B47","v":"Triglycerides"},null," ",{"$f":"_Setup!C47","v":"mg/dL"},{"$f":"_Setup!D47","v":10},{"$f":"_Setup!E47","v":150}]
[{"$f":"_Setup!A47","v":" "},{"$f":"_Setup!B48","v":"Lactate dehydrogenase (LDH)"},null," ",{"$f":"_Setup!C48","v":" u/l "},{"$f":"_Setup!D48","v":100},{"$f":"_Setup!E48","v":190}]
[{"$f":"_Setup!A48","v":"Markers"},{"$f":"_Setup!B49","v":"Beta-2 Microglobulin (B2M)"},null," ",{"$f":"_Setup!C49","v":"g/ml"},{"$f":"_Setup!D49","v":0.01},{"$f":"_Setup!E49","v":2.5}]
[{"$f":"_Setup!A49","v":" "},{"$f":"_Setup!B50","v":"Uric acid"},null," ",{"$f":"_Setup!C50","v":"mg/dL"},{"$f":"_Setup!D50","v":2.5},{"$f":"_Setup!E50","v":8}]
[{"$f":"_Setup!A50","v":" "},{"$f":"_Setup!B51","v":"Urine Albumin /  Albumin/Creatinine Ratio"},null," ",{"$f":"_Setup!C51","v":0},{"$f":"_Setup!D51","v":0},{"$f":"_Setup!E51","v":0}]
[{"$f":"_Setup!A51","v":"Custom"},{"$f":"_Setup!B52","v":"eGFR"},null," ",{"$f":"_Setup!C52","v":"mL/min/1.73m"},{"$f":"_Setup!D52","v":60},{"$f":"_Setup!E52","v":100}]
[{"$f":"_Setup!A52","v":" "},{"$f":"_Setup!B53","v":"cystatin C "},null," ",{"$f":"_Setup!C53","v":0},{"$f":"_Setup!D53","v":0},{"$f":"_Setup!E53","v":0}]
[{"$f":"_Setup!A53","v":" "},{"$f":"_Setup!B54","v":"Custom 4"},null," ",{"$f":"_Setup!C54","v":0},{"$f":"_Setup!D54","v":0},{"$f":"_Setup!E54","v":0}]
[{"$f":"_Setup!A54","v":" "},{"$f":"_Setup!B55","v":"Custom 5"},null," ",{"$f":"_Setup!C55","v":0},{"$f":"_Setup!D55","v":0},{"$f":"_Setup!E55","v":0}]

{"sheet":"_5","index":21,"n_rows":53,"n_cols":7,"rows_kept":53,"cut":false,"hidden":false,"merged":[]}
[null,"Date",null,"Lab 1","Lab 2","Lab 3","Lab 4"]
[null,null,null,"Lab 5","Lab 6","Lab 7","Lab 8"]
["Lab Setup","Lab Measures",null,"Lab 9","Lab 10","Lab 11","Lab 12"]
["Lab Report","Lab Plot"]
["TYPE","TEST NAME","RESULT","H/L","UNITS","L","H"]
[{"$f":"_Setup!A8","v":"Complete Metabolic Profile"},{"$f":"_Setup!B8","v":"ALP (Alkaline Phosphatase)"},155,{"$f":"IF(ISBLANK(C6),\" \",IF(C6<F6,\"L\",IF(C6>G6,\"H\",\" \")))","v":"H"},{"$f":"_Setup!C8","v":"IU/L"},{"$f":"_Setup!D8","v":30},{"$f":"_Setup!E8","v":130}]
[{"$f":"_Setup!A9","v":" "},{"$f":"_Setup!B9","v":"ALT (amino alanine transferase)"},null,{"$f":"IF(ISBLANK(C7),\" \",IF(C7<F7,\"L\",IF(C7>G7,\"H\",\" \")))","v":" "},{"$f":"_Setup!C9","v":"IU/L"},{"$f":"_Setup!D9","v":5},{"$f":"_Setup!E9","v":40}]
[{"$f":"_Setup!A10","v":" "},{"$f":"_Setup!B10","v":"AST (aspartate aminotransferase)"},null," ",{"$f":"_Setup!C10","v":"IU/L"},{"$f":"_Setup!D10","v":10},{"$f":"_Setup!E10","v":45}]
[{"$f":"_Setup!A11","v":" "},{"$f":"_Setup!B11","v":"Albumin, serum (Alb)"},null," ",{"$f":"_Setup!C11","v":"gm/dL "},{"$f":"_Setup!D11","v":3.5},{"$f":"_Setup!E11","v":5}]
[{"$f":"_Setup!A12","v":" "},{"$f":"_Setup!B12","v":"Bilirubin, Total (Bili), serum"},null," ",{"$f":"_Setup!C12","v":"mg/dL"},{"$f":"_Setup!D12","v":0.2},{"$f":"_Setup!E12","v":1}]
[{"$f":"_Setup!A13","v":" "},{"$f":"_Setup!B13","v":"BUN (Blood urea nitrogen)"},21,"H",{"$f":"_Setup!C13","v":"mg/dL"},{"$f":"_Setup!D13","v":8},{"$f":"_Setup!E13","v":18}]
[{"$f":"_Setup!A14","v":" "},{"$f":"_Setup!B14","v":"Ca - Calcium"},null," ",{"$f":"_Setup!C14","v":"mg/dL"},{"$f":"_Setup!D14","v":8.5},{"$f":"_Setup!E14","v":10.5}]
[{"$f":"_Setup!A15","v":" "},{"$f":"_Setup!B15","v":"CI - Chloride"},null," ",{"$f":"_Setup!C15","v":"mEq/L"},{"$f":"_Setup!D15","v":97},{"$f":"_Setup!E15","v":107}]
[{"$f":"_Setup!A16","v":" "},{"$f":"_Setup!B16","v":"CO2 - Carbon dioxide"},null," ",{"$f":"_Setup!C16","v":"mEq/L"},{"$f":"_Setup!D16","v":20},{"$f":"_Setup!E16","v":29}]
[{"$f":"_Setup!A17","v":" "},{"$f":"_Setup!B17","v":"CRT - Creatinine"},null," ",{"$f":"_Setup!C17","v":"mg/dL"},{"$f":"_Setup!D17","v":0.6},{"$f":"_Setup!E17","v":1.5}]
[{"$f":"_Setup!A18","v":" "},{"$f":"_Setup!B18","v":"Glucose"},null," ",{"$f":"_Setup!C18","v":"mg/dL"},{"$f":"_Setup!D18","v":65},{"$f":"_Setup!E18","v":110}]
[{"$f":"_Setup!A19","v":" "},{"$f":"_Setup!B19","v":"Mg - Magnesium"},null," ",{"$f":"_Setup!C19","v":"mg/dL"},{"$f":"_Setup!D19","v":1.8},{"$f":"_Setup!E19","v":2.5}]
[{"$f":"_Setup!A20","v":" "},{"$f":"_Setup!B20","v":"Potassium (K)"},null," ",{"$f":"_Setup!C20","v":"mEq/L"},{"$f":"_Setup!D20","v":3.5},{"$f":"_Setup!E20","v":5}]
[{"$f":"_Setup!A21","v":" "},{"$f":"_Setup!B21","v":"Sodium (Na)"},null," ",{"$f":"_Setup!C21","v":"mEq/L"},{"$f":"_Setup!D21","v":135},{"$f":"_Setup!E21","v":145}]
[{"$f":"_Setup!A22","v":" "},{"$f":"_Setup!B22","v":"Total Protein"},null," ",{"$f":"_Setup!C22","v":"gm/dL "},{"$f":"_Setup!D22","v":6},{"$f":"_Setup!E22","v":8}]
[{"$f":"_Setup!A23","v":"CBC"},{"$f":"_Setup!B23","v":"RBC - Red Blood Cells"},null," ",{"$f":"_Setup!C23","v":"(X106/uL)"},{"$f":"_Setup!D23","v":4.4000000000000004},{"$f":"_Setup!E23","v":5.6}]
[{"$f":"_Setup!A24","v":" "},{"$f":"_Setup!B24","v":"Hgb - Hemoglobin"},null," ",{"$f":"_Setup!C24","v":"(g/dL)"},{"$f":"_Setup!D24","v":13},{"$f":"_Setup!E24","v":18}]
[{"$f":"_Setup!A25","v":" "},{"$f":"_Setup!B25","v":"Hct - Hematocrtit"},null," ",{"$f":"_Setup!C25","v":"%"},{"$f":"_Setup!D25","v":0.38},{"$f":"_Setup!E25","v":0.5}]
[{"$f":"_Setup!A26","v":" "},{"$f":"_Setup!B26","v":"MCV - Mean Corp. Volume"},null," ",{"$f":"_Setup!C26","v":"(fL)"},{"$f":"_Setup!D26","v":81},{"$f":"_Setup!E26","v":98}]
[{"$f":"_Setup!A27","v":" "},{"$f":"_Setup!B27","v":"MCH - Mean Corp. Hgb"},null," ",{"$f":"_Setup!C27","v":"(pg)"},{"$f":"_Setup!D27","v":27.3},{"$f":"_Setup!E27","v":33.6}]
[{"$f":"_Setup!A28","v":" "},{"$f":"_Setup!B28","v":"MCHC - Mean Corp. Hgb Concentration"},null," ",{"$f":"_Setup!C28","v":"(g/dL)"},{"$f":"_Setup!D28","v":32.299999999999997},{"$f":"_Setup!E28","v":35.700000000000003}]
[{"$f":"_Setup!A29","v":" "},{"$f":"_Setup!B29","v":"RDW - Red cell Dist Width"},null," ",{"$f":"_Setup!C29","v":"%"},{"$f":"_Setup!D29","v":0.11799999999999999},{"$f":"_Setup!E29","v":0.14099999999999999}]
[{"$f":"_Setup!A30","v":" "},{"$f":"_Setup!B30","v":"ESR - Erythrocyte Sedimentation Rate"},null," ",{"$f":"_Setup!C30","v":"mm/hr"},{"$f":"_Setup!D30","v":0.01},{"$f":"_Setup!E30","v":20}]
[{"$f":"_Setup!A31","v":" "},{"$f":"_Setup!B31","v":"Platelets (Thrombocytes)"},null," ",{"$f":"_Setup!C31","v":"(X103/uL)"},{"$f":"_Setup!D31","v":150},{"$f":"_Setup!E31","v":400}]
[{"$f":"_Setup!A31","v":" "},{"$f":"_Setup!B32","v":"WBC - White blood cells"},null," ",{"$f":"_Setup!C32","v":"(X103/uL)"},{"$f":"_Setup!D32","v":4.3},{"$f":"_Setup!E32","v":10}]
[{"$f":"_Setup!A32","v":" "},{"$f":"_Setup!B33","v":"Basophils"},null,{"$f":"IF(ISBLANK(C31),\" \",IF(C31<F31,\"L\",IF(C31>G31,\"H\",\" \")))","v":" "},{"$f":"_Setup!C33","v":"(X103/uL)"},{"$f":"_Setup!D33","v":0.01},{"$f":"_Setup!E33","v":0.2}]
[{"$f":"_Setup!A33","v":" "},{"$f":"_Setup!B34","v":"Eosinophils"},null,{"$f":"IF(ISBLANK(C32),\" \",IF(C32<F32,\"L\",IF(C32>G32,\"H\",\" \")))","v":" "},{"$f":"_Setup!C34","v":"(X103/uL)"},{"$f":"_Setup!D34","v":0.01},{"$f":"_Setup!E34","v":0.5}]
[{"$f":"_Setup!A34","v":" "},{"$f":"_Setup!B35","v":"Monocytes"},null," ",{"$f":"_Setup!C35","v":"(X103/uL)"},{"$f":"_Setup!D35","v":0.01},{"$f":"_Setup!E35","v":0.8}]
[{"$f":"_Setup!A35","v":" "},{"$f":"_Setup!B36","v":"Total Neutrophils"},null," ",{"$f":"_Setup!C36","v":"%"},{"$f":"_Setup!D36","v":38},{"$f":"_Setup!E36","v":80}]
[{"$f":"_Setup!A36","v":"Differential"},{"$f":"_Setup!B37","v":"Total Neutrophils, Absolute (ANC)"},null," ",{"$f":"_Setup!C37","v":"Cells/Cu.Mm"},{"$f":"_Setup!D37","v":1650},{"$f":"_Setup!E37","v":8000}]
[{"$f":"_Setup!A37","v":" "},{"$f":"_Setup!B38","v":"Total Lymphocytes"},null," ",{"$f":"_Setup!C38","v":"%"},{"$f":"_Setup!D38","v":15},{"$f":"_Setup!E38","v":49}]
[{"$f":"_Setup!A38","v":" "},{"$f":"_Setup!B39","v":"Total Lymphocytes, Absolute"},null," ",{"$f":"_Setup!C39","v":"Cells/Cu.Mm"},{"$f":"_Setup!D39","v":1000},{"$f":"_Setup!E39","v":3500}]
[{"$f":"_Setup!A39","v":" "},{"$f":"_Setup!B40","v":"Monocytes"},null," ",{"$f":"_Setup!C40","v":"%"},{"$f":"_Setup!D40","v":0.01},{"$f":"_Setup!E40","v":13}]
[{"$f":"_Setup!A40","v":" "},{"$f":"_Setup!B41","v":"Monocytes, Absolute "},null," ",{"$f":"_Setup!C41","v":"Cells/Cu.Mm"},{"$f":"_Setup!D41","v":40},{"$f":"_Setup!E41","v":900}]
[{"$f":"_Setup!A41","v":" "},{"$f":"_Setup!B42","v":"Basophils"},null," ",{"$f":"_Setup!C42","v":"%"},{"$f":"_Setup!D42","v":0.01},{"$f":"_Setup!E42","v":2}]
[{"$f":"_Setup!A42","v":" "},{"$f":"_Setup!B43","v":"Basophils, Absolute"},null," ",{"$f":"_Setup!C43","v":"Cells/Cu.Mm"},{"$f":"_Setup!D43","v":0.01},{"$f":"_Setup!E43","v":125}]
[{"$f":"_Setup!A43","v":" "},{"$f":"_Setup!B44","v":"Eosinophils"},null," ",{"$f":"_Setup!C44","v":"%"},{"$f":"_Setup!D44","v":0.01},{"$f":"_Setup!E44","v":8}]
[{"$f":"_Setup!A44","v":" "},{"$f":"_Setup!B45","v":"Eosinophils, Absolute"},null," ",{"$f":"_Setup!C45","v":"Cells/Cu.Mm"},{"$f":"_Setup!D45","v":30},{"$f":"_Setup!E45","v":600}]
[{"$f":"_Setup!A45","v":" "},{"$f":"_Setup!B46","v":"Cholesterol, total"},null," ",{"$f":"_Setup!C46","v":"mg/dL"},{"$f":"_Setup!D46","v":130},{"$f":"_Setup!E46","v":200}]
[{"$f":"_Setup!A46","v":"Lipids"},{"$f":"_Setup!B47","v":"Triglycerides"},null," ",{"$f":"_Setup!C47","v":"mg/dL"},{"$f":"_Setup!D47","v":10},{"$f":"_Setup!E47","v":150}]
[{"$f":"_Setup!A47","v":" "},{"$f":"_Setup!B48","v":"Lactate dehydrogenase (LDH)"},null," ",{"$f":"_Setup!C48","v":" u/l "},{"$f":"_Setup!D48","v":100},{"$f":"_Setup!E48","v":190}]
[{"$f":"_Setup!A48","v":"Markers"},{"$f":"_Setup!B49","v":"Beta-2 Microglobulin (B2M)"},null," ",{"$f":"_Setup!C49","v":"g/ml"},{"$f":"_Setup!D49","v":0.01},{"$f":"_Setup!E49","v":2.5}]
[{"$f":"_Setup!A49","v":" "},{"$f":"_Setup!B50","v":"Uric acid"},null," ",{"$f":"_Setup!C50","v":"mg/dL"},{"$f":"_Setup!D50","v":2.5},{"$f":"_Setup!E50","v":8}]
[{"$f":"_Setup!A50","v":" "},{"$f":"_Setup!B51","v":"Urine Albumin /  Albumin/Creatinine Ratio"},null," ",{"$f":"_Setup!C51","v":0},{"$f":"_Setup!D51","v":0},{"$f":"_Setup!E51","v":0}]
[{"$f":"_Setup!A51","v":"Custom"},{"$f":"_Setup!B52","v":"eGFR"},null," ",{"$f":"_Setup!C52","v":"mL/min/1.73m"},{"$f":"_Setup!D52","v":60},{"$f":"_Setup!E52","v":100}]
[{"$f":"_Setup!A52","v":" "},{"$f":"_Setup!B53","v":"cystatin C "},null," ",{"$f":"_Setup!C53","v":0},{"$f":"_Setup!D53","v":0},{"$f":"_Setup!E53","v":0}]
[{"$f":"_Setup!A53","v":" "},{"$f":"_Setup!B54","v":"Custom 4"},null," ",{"$f":"_Setup!C54","v":0},{"$f":"_Setup!D54","v":0},{"$f":"_Setup!E54","v":0}]
[{"$f":"_Setup!A54","v":" "},{"$f":"_Setup!B55","v":"Custom 5"},null," ",{"$f":"_Setup!C55","v":0},{"$f":"_Setup!D55","v":0},{"$f":"_Setup!E55","v":0}]

{"sheet":"_6","index":22,"n_rows":53,"n_cols":7,"rows_kept":53,"cut":false,"hidden":false,"merged":[]}
[null,"Date",null,"Lab 1","Lab 2","Lab 3","Lab 4"]
[null,null,null,"Lab 5","Lab 6","Lab 7","Lab 8"]
["Lab Setup","Lab Measures",null,"Lab 9","Lab 10","Lab 11","Lab 12"]
["Lab Report","Lab Plot"]
["TYPE","TEST NAME","RESULT","H/L","UNITS","L","H"]
[{"$f":"_Setup!A8","v":"Complete Metabolic Profile"},{"$f":"_Setup!B8","v":"ALP (Alkaline Phosphatase)"},44,{"$f":"IF(ISBLANK(C6),\" \",IF(C6<F6,\"L\",IF(C6>G6,\"H\",\" \")))","v":" "},{"$f":"_Setup!C8","v":"IU/L"},{"$f":"_Setup!D8","v":30},{"$f":"_Setup!E8","v":130}]
[{"$f":"_Setup!A9","v":" "},{"$f":"_Setup!B9","v":"ALT (amino alanine transferase)"},null,{"$f":"IF(ISBLANK(C7),\" \",IF(C7<F7,\"L\",IF(C7>G7,\"H\",\" \")))","v":" "},{"$f":"_Setup!C9","v":"IU/L"},{"$f":"_Setup!D9","v":5},{"$f":"_Setup!E9","v":40}]
[{"$f":"_Setup!A10","v":" "},{"$f":"_Setup!B10","v":"AST (aspartate aminotransferase)"},null," ",{"$f":"_Setup!C10","v":"IU/L"},{"$f":"_Setup!D10","v":10},{"$f":"_Setup!E10","v":45}]
[{"$f":"_Setup!A11","v":" "},{"$f":"_Setup!B11","v":"Albumin, serum (Alb)"},null," ",{"$f":"_Setup!C11","v":"gm/dL "},{"$f":"_Setup!D11","v":3.5},{"$f":"_Setup!E11","v":5}]
[{"$f":"_Setup!A12","v":" "},{"$f":"_Setup!B12","v":"Bilirubin, Total (Bili), serum"},null," ",{"$f":"_Setup!C12","v":"mg/dL"},{"$f":"_Setup!D12","v":0.2},{"$f":"_Setup!E12","v":1}]
[{"$f":"_Setup!A13","v":" "},{"$f":"_Setup!B13","v":"BUN (Blood urea nitrogen)"},23,"H",{"$f":"_Setup!C13","v":"mg/dL"},{"$f":"_Setup!D13","v":8},{"$f":"_Setup!E13","v":18}]
[{"$f":"_Setup!A14","v":" "},{"$f":"_Setup!B14","v":"Ca - Calcium"},null," ",{"$f":"_Setup!C14","v":"mg/dL"},{"$f":"_Setup!D14","v":8.5},{"$f":"_Setup!E14","v":10.5}]
[{"$f":"_Setup!A15","v":" "},{"$f":"_Setup!B15","v":"CI - Chloride"},null," ",{"$f":"_Setup!C15","v":"mEq/L"},{"$f":"_Setup!D15","v":97},{"$f":"_Setup!E15","v":107}]
[{"$f":"_Setup!A16","v":" "},{"$f":"_Setup!B16","v":"CO2 - Carbon dioxide"},null," ",{"$f":"_Setup!C16","v":"mEq/L"},{"$f":"_Setup!D16","v":20},{"$f":"_Setup!E16","v":29}]
[{"$f":"_Setup!A17","v":" "},{"$f":"_Setup!B17","v":"CRT - Creatinine"},null," ",{"$f":"_Setup!C17","v":"mg/dL"},{"$f":"_Setup!D17","v":0.6},{"$f":"_Setup!E17","v":1.5}]
[{"$f":"_Setup!A18","v":" "},{"$f":"_Setup!B18","v":"Glucose"},null," ",{"$f":"_Setup!C18","v":"mg/dL"},{"$f":"_Setup!D18","v":65},{"$f":"_Setup!E18","v":110}]
[{"$f":"_Setup!A19","v":" "},{"$f":"_Setup!B19","v":"Mg - Magnesium"},null," ",{"$f":"_Setup!C19","v":"mg/dL"},{"$f":"_Setup!D19","v":1.8},{"$f":"_Setup!E19","v":2.5}]
[{"$f":"_Setup!A20","v":" "},{"$f":"_Setup!B20","v":"Potassium (K)"},null," ",{"$f":"_Setup!C20","v":"mEq/L"},{"$f":"_Setup!D20","v":3.5},{"$f":"_Setup!E20","v":5}]
[{"$f":"_Setup!A21","v":" "},{"$f":"_Setup!B21","v":"Sodium (Na)"},null," ",{"$f":"_Setup!C21","v":"mEq/L"},{"$f":"_Setup!D21","v":135},{"$f":"_Setup!E21","v":145}]
[{"$f":"_Setup!A22","v":" "},{"$f":"_Setup!B22","v":"Total Protein"},null," ",{"$f":"_Setup!C22","v":"gm/dL "},{"$f":"_Setup!D22","v":6},{"$f":"_Setup!E22","v":8}]
[{"$f":"_Setup!A23","v":"CBC"},{"$f":"_Setup!B23","v":"RBC - Red Blood Cells"},null," ",{"$f":"_Setup!C23","v":"(X106/uL)"},{"$f":"_Setup!D23","v":4.4000000000000004},{"$f":"_Setup!E23","v":5.6}]
[{"$f":"_Setup!A24","v":" "},{"$f":"_Setup!B24","v":"Hgb - Hemoglobin"},null," ",{"$f":"_Setup!C24","v":"(g/dL)"},{"$f":"_Setup!D24","v":13},{"$f":"_Setup!E24","v":18}]
[{"$f":"_Setup!A25","v":" "},{"$f":"_Setup!B25","v":"Hct - Hematocrtit"},null," ",{"$f":"_Setup!C25","v":"%"},{"$f":"_Setup!D25","v":0.38},{"$f":"_Setup!E25","v":0.5}]
[{"$f":"_Setup!A26","v":" "},{"$f":"_Setup!B26","v":"MCV - Mean Corp. Volume"},null," ",{"$f":"_Setup!C26","v":"(fL)"},{"$f":"_Setup!D26","v":81},{"$f":"_Setup!E26","v":98}]
[{"$f":"_Setup!A27","v":" "},{"$f":"_Setup!B27","v":"MCH - Mean Corp. Hgb"},null," ",{"$f":"_Setup!C27","v":"(pg)"},{"$f":"_Setup!D27","v":27.3},{"$f":"_Setup!E27","v":33.6}]
[{"$f":"_Setup!A28","v":" "},{"$f":"_Setup!B28","v":"MCHC - Mean Corp. Hgb Concentration"},null," ",{"$f":"_Setup!C28","v":"(g/dL)"},{"$f":"_Setup!D28","v":32.299999999999997},{"$f":"_Setup!E28","v":35.700000000000003}]
[{"$f":"_Setup!A29","v":" "},{"$f":"_Setup!B29","v":"RDW - Red cell Dist Width"},null," ",{"$f":"_Setup!C29","v":"%"},{"$f":"_Setup!D29","v":0.11799999999999999},{"$f":"_Setup!E29","v":0.14099999999999999}]
[{"$f":"_Setup!A30","v":" "},{"$f":"_Setup!B30","v":"ESR - Erythrocyte Sedimentation Rate"},null," ",{"$f":"_Setup!C30","v":"mm/hr"},{"$f":"_Setup!D30","v":0.01},{"$f":"_Setup!E30","v":20}]
[{"$f":"_Setup!A31","v":" "},{"$f":"_Setup!B31","v":"Platelets (Thrombocytes)"},null," ",{"$f":"_Setup!C31","v":"(X103/uL)"},{"$f":"_Setup!D31","v":150},{"$f":"_Setup!E31","v":400}]
[{"$f":"_Setup!A31","v":" "},{"$f":"_Setup!B32","v":"WBC - White blood cells"},null," ",{"$f":"_Setup!C32","v":"(X103/uL)"},{"$f":"_Setup!D32","v":4.3},{"$f":"_Setup!E32","v":10}]
[{"$f":"_Setup!A32","v":" "},{"$f":"_Setup!B33","v":"Basophils"},null,{"$f":"IF(ISBLANK(C31),\" \",IF(C31<F31,\"L\",IF(C31>G31,\"H\",\" \")))","v":" "},{"$f":"_Setup!C33","v":"(X103/uL)"},{"$f":"_Setup!D33","v":0.01},{"$f":"_Setup!E33","v":0.2}]
[{"$f":"_Setup!A33","v":" "},{"$f":"_Setup!B34","v":"Eosinophils"},null,{"$f":"IF(ISBLANK(C32),\" \",IF(C32<F32,\"L\",IF(C32>G32,\"H\",\" \")))","v":" "},{"$f":"_Setup!C34","v":"(X103/uL)"},{"$f":"_Setup!D34","v":0.01},{"$f":"_Setup!E34","v":0.5}]
[{"$f":"_Setup!A34","v":" "},{"$f":"_Setup!B35","v":"Monocytes"},null," ",{"$f":"_Setup!C35","v":"(X103/uL)"},{"$f":"_Setup!D35","v":0.01},{"$f":"_Setup!E35","v":0.8}]
[{"$f":"_Setup!A35","v":" "},{"$f":"_Setup!B36","v":"Total Neutrophils"},null," ",{"$f":"_Setup!C36","v":"%"},{"$f":"_Setup!D36","v":38},{"$f":"_Setup!E36","v":80}]
[{"$f":"_Setup!A36","v":"Differential"},{"$f":"_Setup!B37","v":"Total Neutrophils, Absolute (ANC)"},null," ",{"$f":"_Setup!C37","v":"Cells/Cu.Mm"},{"$f":"_Setup!D37","v":1650},{"$f":"_Setup!E37","v":8000}]
[{"$f":"_Setup!A37","v":" "},{"$f":"_Setup!B38","v":"Total Lymphocytes"},null," ",{"$f":"_Setup!C38","v":"%"},{"$f":"_Setup!D38","v":15},{"$f":"_Setup!E38","v":49}]
[{"$f":"_Setup!A38","v":" "},{"$f":"_Setup!B39","v":"Total Lymphocytes, Absolute"},null," ",{"$f":"_Setup!C39","v":"Cells/Cu.Mm"},{"$f":"_Setup!D39","v":1000},{"$f":"_Setup!E39","v":3500}]
[{"$f":"_Setup!A39","v":" "},{"$f":"_Setup!B40","v":"Monocytes"},null," ",{"$f":"_Setup!C40","v":"%"},{"$f":"_Setup!D40","v":0.01},{"$f":"_Setup!E40","v":13}]
[{"$f":"_Setup!A40","v":" "},{"$f":"_Setup!B41","v":"Monocytes, Absolute "},null," ",{"$f":"_Setup!C41","v":"Cells/Cu.Mm"},{"$f":"_Setup!D41","v":40},{"$f":"_Setup!E41","v":900}]
[{"$f":"_Setup!A41","v":" "},{"$f":"_Setup!B42","v":"Basophils"},null," ",{"$f":"_Setup!C42","v":"%"},{"$f":"_Setup!D42","v":0.01},{"$f":"_Setup!E42","v":2}]
[{"$f":"_Setup!A42","v":" "},{"$f":"_Setup!B43","v":"Basophils, Absolute"},null," ",{"$f":"_Setup!C43","v":"Cells/Cu.Mm"},{"$f":"_Setup!D43","v":0.01},{"$f":"_Setup!E43","v":125}]
[{"$f":"_Setup!A43","v":" "},{"$f":"_Setup!B44","v":"Eosinophils"},null," ",{"$f":"_Setup!C44","v":"%"},{"$f":"_Setup!D44","v":0.01},{"$f":"_Setup!E44","v":8}]
[{"$f":"_Setup!A44","v":" "},{"$f":"_Setup!B45","v":"Eosinophils, Absolute"},null," ",{"$f":"_Setup!C45","v":"Cells/Cu.Mm"},{"$f":"_Setup!D45","v":30},{"$f":"_Setup!E45","v":600}]
[{"$f":"_Setup!A45","v":" "},{"$f":"_Setup!B46","v":"Cholesterol, total"},null," ",{"$f":"_Setup!C46","v":"mg/dL"},{"$f":"_Setup!D46","v":130},{"$f":"_Setup!E46","v":200}]
[{"$f":"_Setup!A46","v":"Lipids"},{"$f":"_Setup!B47","v":"Triglycerides"},null," ",{"$f":"_Setup!C47","v":"mg/dL"},{"$f":"_Setup!D47","v":10},{"$f":"_Setup!E47","v":150}]
[{"$f":"_Setup!A47","v":" "},{"$f":"_Setup!B48","v":"Lactate dehydrogenase (LDH)"},null," ",{"$f":"_Setup!C48","v":" u/l "},{"$f":"_Setup!D48","v":100},{"$f":"_Setup!E48","v":190}]
[{"$f":"_Setup!A48","v":"Markers"},{"$f":"_Setup!B49","v":"Beta-2 Microglobulin (B2M)"},null," ",{"$f":"_Setup!C49","v":"g/ml"},{"$f":"_Setup!D49","v":0.01},{"$f":"_Setup!E49","v":2.5}]
[{"$f":"_Setup!A49","v":" "},{"$f":"_Setup!B50","v":"Uric acid"},null," ",{"$f":"_Setup!C50","v":"mg/dL"},{"$f":"_Setup!D50","v":2.5},{"$f":"_Setup!E50","v":8}]
[{"$f":"_Setup!A50","v":" "},{"$f":"_Setup!B51","v":"Urine Albumin /  Albumin/Creatinine Ratio"},null," ",{"$f":"_Setup!C51","v":0},{"$f":"_Setup!D51","v":0},{"$f":"_Setup!E51","v":0}]
[{"$f":"_Setup!A51","v":"Custom"},{"$f":"_Setup!B52","v":"eGFR"},null," ",{"$f":"_Setup!C52","v":"mL/min/1.73m"},{"$f":"_Setup!D52","v":60},{"$f":"_Setup!E52","v":100}]
[{"$f":"_Setup!A52","v":" "},{"$f":"_Setup!B53","v":"cystatin C "},null," ",{"$f":"_Setup!C53","v":0},{"$f":"_Setup!D53","v":0},{"$f":"_Setup!E53","v":0}]
[{"$f":"_Setup!A53","v":" "},{"$f":"_Setup!B54","v":"Custom 4"},null," ",{"$f":"_Setup!C54","v":0},{"$f":"_Setup!D54","v":0},{"$f":"_Setup!E54","v":0}]
[{"$f":"_Setup!A54","v":" "},{"$f":"_Setup!B55","v":"Custom 5"},null," ",{"$f":"_Setup!C55","v":0},{"$f":"_Setup!D55","v":0},{"$f":"_Setup!E55","v":0}]

{"sheet":"_7","index":23,"n_rows":53,"n_cols":7,"rows_kept":53,"cut":false,"hidden":false,"merged":[]}
[null,"Date",null,"Lab 1","Lab 2","Lab 3","Lab 4"]
[null,null,null,"Lab 5","Lab 6","Lab 7","Lab 8"]
["Lab Setup","Lab Measures",null,"Lab 9","Lab 10","Lab 11","Lab 12"]
["Lab Report","Lab Plot"]
["TYPE","TEST NAME","RESULT","H/L","UNITS","L","H"]
[{"$f":"_Setup!A8","v":"Complete Metabolic Profile"},{"$f":"_Setup!B8","v":"ALP (Alkaline Phosphatase)"},55,{"$f":"IF(ISBLANK(C6),\" \",IF(C6<F6,\"L\",IF(C6>G6,\"H\",\" \")))","v":" "},{"$f":"_Setup!C8","v":"IU/L"},{"$f":"_Setup!D8","v":30},{"$f":"_Setup!E8","v":130}]
[{"$f":"_Setup!A9","v":" "},{"$f":"_Setup!B9","v":"ALT (amino alanine transferase)"},null,{"$f":"IF(ISBLANK(C7),\" \",IF(C7<F7,\"L\",IF(C7>G7,\"H\",\" \")))","v":" "},{"$f":"_Setup!C9","v":"IU/L"},{"$f":"_Setup!D9","v":5},{"$f":"_Setup!E9","v":40}]
[{"$f":"_Setup!A10","v":" "},{"$f":"_Setup!B10","v":"AST (aspartate aminotransferase)"},null," ",{"$f":"_Setup!C10","v":"IU/L"},{"$f":"_Setup!D10","v":10},{"$f":"_Setup!E10","v":45}]
[{"$f":"_Setup!A11","v":" "},{"$f":"_Setup!B11","v":"Albumin, serum (Alb)"},null," ",{"$f":"_Setup!C11","v":"gm/dL "},{"$f":"_Setup!D11","v":3.5},{"$f":"_Setup!E11","v":5}]
[{"$f":"_Setup!A12","v":" "},{"$f":"_Setup!B12","v":"Bilirubin, Total (Bili), serum"},null," ",{"$f":"_Setup!C12","v":"mg/dL"},{"$f":"_Setup!D12","v":0.2},{"$f":"_Setup!E12","v":1}]
[{"$f":"_Setup!A13","v":" "},{"$f":"_Setup!B13","v":"BUN (Blood urea nitrogen)"},27,"H",{"$f":"_Setup!C13","v":"mg/dL"},{"$f":"_Setup!D13","v":8},{"$f":"_Setup!E13","v":18}]
[{"$f":"_Setup!A14","v":" "},{"$f":"_Setup!B14","v":"Ca - Calcium"},null," ",{"$f":"_Setup!C14","v":"mg/dL"},{"$f":"_Setup!D14","v":8.5},{"$f":"_Setup!E14","v":10.5}]
[{"$f":"_Setup!A15","v":" "},{"$f":"_Setup!B15","v":"CI - Chloride"},null," ",{"$f":"_Setup!C15","v":"mEq/L"},{"$f":"_Setup!D15","v":97},{"$f":"_Setup!E15","v":107}]
[{"$f":"_Setup!A16","v":" "},{"$f":"_Setup!B16","v":"CO2 - Carbon dioxide"},null," ",{"$f":"_Setup!C16","v":"mEq/L"},{"$f":"_Setup!D16","v":20},{"$f":"_Setup!E16","v":29}]
[{"$f":"_Setup!A17","v":" "},{"$f":"_Setup!B17","v":"CRT - Creatinine"},null," ",{"$f":"_Setup!C17","v":"mg/dL"},{"$f":"_Setup!D17","v":0.6},{"$f":"_Setup!E17","v":1.5}]
[{"$f":"_Setup!A18","v":" "},{"$f":"_Setup!B18","v":"Glucose"},null," ",{"$f":"_Setup!C18","v":"mg/dL"},{"$f":"_Setup!D18","v":65},{"$f":"_Setup!E18","v":110}]
[{"$f":"_Setup!A19","v":" "},{"$f":"_Setup!B19","v":"Mg - Magnesium"},null," ",{"$f":"_Setup!C19","v":"mg/dL"},{"$f":"_Setup!D19","v":1.8},{"$f":"_Setup!E19","v":2.5}]
[{"$f":"_Setup!A20","v":" "},{"$f":"_Setup!B20","v":"Potassium (K)"},null," ",{"$f":"_Setup!C20","v":"mEq/L"},{"$f":"_Setup!D20","v":3.5},{"$f":"_Setup!E20","v":5}]
[{"$f":"_Setup!A21","v":" "},{"$f":"_Setup!B21","v":"Sodium (Na)"},null," ",{"$f":"_Setup!C21","v":"mEq/L"},{"$f":"_Setup!D21","v":135},{"$f":"_Setup!E21","v":145}]
[{"$f":"_Setup!A22","v":" "},{"$f":"_Setup!B22","v":"Total Protein"},null," ",{"$f":"_Setup!C22","v":"gm/dL "},{"$f":"_Setup!D22","v":6},{"$f":"_Setup!E22","v":8}]
[{"$f":"_Setup!A23","v":"CBC"},{"$f":"_Setup!B23","v":"RBC - Red Blood Cells"},null," ",{"$f":"_Setup!C23","v":"(X106/uL)"},{"$f":"_Setup!D23","v":4.4000000000000004},{"$f":"_Setup!E23","v":5.6}]
[{"$f":"_Setup!A24","v":" "},{"$f":"_Setup!B24","v":"Hgb - Hemoglobin"},null," ",{"$f":"_Setup!C24","v":"(g/dL)"},{"$f":"_Setup!D24","v":13},{"$f":"_Setup!E24","v":18}]
[{"$f":"_Setup!A25","v":" "},{"$f":"_Setup!B25","v":"Hct - Hematocrtit"},null," ",{"$f":"_Setup!C25","v":"%"},{"$f":"_Setup!D25","v":0.38},{"$f":"_Setup!E25","v":0.5}]
[{"$f":"_Setup!A26","v":" "},{"$f":"_Setup!B26","v":"MCV - Mean Corp. Volume"},null," ",{"$f":"_Setup!C26","v":"(fL)"},{"$f":"_Setup!D26","v":81},{"$f":"_Setup!E26","v":98}]
[{"$f":"_Setup!A27","v":" "},{"$f":"_Setup!B27","v":"MCH - Mean Corp. Hgb"},null," ",{"$f":"_Setup!C27","v":"(pg)"},{"$f":"_Setup!D27","v":27.3},{"$f":"_Setup!E27","v":33.6}]
[{"$f":"_Setup!A28","v":" "},{"$f":"_Setup!B28","v":"MCHC - Mean Corp. Hgb Concentration"},null," ",{"$f":"_Setup!C28","v":"(g/dL)"},{"$f":"_Setup!D28","v":32.299999999999997},{"$f":"_Setup!E28","v":35.700000000000003}]
[{"$f":"_Setup!A29","v":" "},{"$f":"_Setup!B29","v":"RDW - Red cell Dist Width"},null," ",{"$f":"_Setup!C29","v":"%"},{"$f":"_Setup!D29","v":0.11799999999999999},{"$f":"_Setup!E29","v":0.14099999999999999}]
[{"$f":"_Setup!A30","v":" "},{"$f":"_Setup!B30","v":"ESR - Erythrocyte Sedimentation Rate"},null," ",{"$f":"_Setup!C30","v":"mm/hr"},{"$f":"_Setup!D30","v":0.01},{"$f":"_Setup!E30","v":20}]
[{"$f":"_Setup!A31","v":" "},{"$f":"_Setup!B31","v":"Platelets (Thrombocytes)"},null," ",{"$f":"_Setup!C31","v":"(X103/uL)"},{"$f":"_Setup!D31","v":150},{"$f":"_Setup!E31","v":400}]
[{"$f":"_Setup!A31","v":" "},{"$f":"_Setup!B32","v":"WBC - White blood cells"},null," ",{"$f":"_Setup!C32","v":"(X103/uL)"},{"$f":"_Setup!D32","v":4.3},{"$f":"_Setup!E32","v":10}]
[{"$f":"_Setup!A32","v":" "},{"$f":"_Setup!B33","v":"Basophils"},null,{"$f":"IF(ISBLANK(C31),\" \",IF(C31<F31,\"L\",IF(C31>G31,\"H\",\" \")))","v":" "},{"$f":"_Setup!C33","v":"(X103/uL)"},{"$f":"_Setup!D33","v":0.01},{"$f":"_Setup!E33","v":0.2}]
[{"$f":"_Setup!A33","v":" "},{"$f":"_Setup!B34","v":"Eosinophils"},null,{"$f":"IF(ISBLANK(C32),\" \",IF(C32<F32,\"L\",IF(C32>G32,\"H\",\" \")))","v":" "},{"$f":"_Setup!C34","v":"(X103/uL)"},{"$f":"_Setup!D34","v":0.01},{"$f":"_Setup!E34","v":0.5}]
[{"$f":"_Setup!A34","v":" "},{"$f":"_Setup!B35","v":"Monocytes"},null," ",{"$f":"_Setup!C35","v":"(X103/uL)"},{"$f":"_Setup!D35","v":0.01},{"$f":"_Setup!E35","v":0.8}]
[{"$f":"_Setup!A35","v":" "},{"$f":"_Setup!B36","v":"Total Neutrophils"},null," ",{"$f":"_Setup!C36","v":"%"},{"$f":"_Setup!D36","v":38},{"$f":"_Setup!E36","v":80}]
[{"$f":"_Setup!A36","v":"Differential"},{"$f":"_Setup!B37","v":"Total Neutrophils, Absolute (ANC)"},null," ",{"$f":"_Setup!C37","v":"Cells/Cu.Mm"},{"$f":"_Setup!D37","v":1650},{"$f":"_Setup!E37","v":8000}]
[{"$f":"_Setup!A37","v":" "},{"$f":"_Setup!B38","v":"Total Lymphocytes"},null," ",{"$f":"_Setup!C38","v":"%"},{"$f":"_Setup!D38","v":15},{"$f":"_Setup!E38","v":49}]
[{"$f":"_Setup!A38","v":" "},{"$f":"_Setup!B39","v":"Total Lymphocytes, Absolute"},null," ",{"$f":"_Setup!C39","v":"Cells/Cu.Mm"},{"$f":"_Setup!D39","v":1000},{"$f":"_Setup!E39","v":3500}]
[{"$f":"_Setup!A39","v":" "},{"$f":"_Setup!B40","v":"Monocytes"},null," ",{"$f":"_Setup!C40","v":"%"},{"$f":"_Setup!D40","v":0.01},{"$f":"_Setup!E40","v":13}]
[{"$f":"_Setup!A40","v":" "},{"$f":"_Setup!B41","v":"Monocytes, Absolute "},null," ",{"$f":"_Setup!C41","v":"Cells/Cu.Mm"},{"$f":"_Setup!D41","v":40},{"$f":"_Setup!E41","v":900}]
[{"$f":"_Setup!A41","v":" "},{"$f":"_Setup!B42","v":"Basophils"},null," ",{"$f":"_Setup!C42","v":"%"},{"$f":"_Setup!D42","v":0.01},{"$f":"_Setup!E42","v":2}]
[{"$f":"_Setup!A42","v":" "},{"$f":"_Setup!B43","v":"Basophils, Absolute"},null," ",{"$f":"_Setup!C43","v":"Cells/Cu.Mm"},{"$f":"_Setup!D43","v":0.01},{"$f":"_Setup!E43","v":125}]
[{"$f":"_Setup!A43","v":" "},{"$f":"_Setup!B44","v":"Eosinophils"},null," ",{"$f":"_Setup!C44","v":"%"},{"$f":"_Setup!D44","v":0.01},{"$f":"_Setup!E44","v":8}]
[{"$f":"_Setup!A44","v":" "},{"$f":"_Setup!B45","v":"Eosinophils, Absolute"},null," ",{"$f":"_Setup!C45","v":"Cells/Cu.Mm"},{"$f":"_Setup!D45","v":30},{"$f":"_Setup!E45","v":600}]
[{"$f":"_Setup!A45","v":" "},{"$f":"_Setup!B46","v":"Cholesterol, total"},null," ",{"$f":"_Setup!C46","v":"mg/dL"},{"$f":"_Setup!D46","v":130},{"$f":"_Setup!E46","v":200}]
[{"$f":"_Setup!A46","v":"Lipids"},{"$f":"_Setup!B47","v":"Triglycerides"},null," ",{"$f":"_Setup!C47","v":"mg/dL"},{"$f":"_Setup!D47","v":10},{"$f":"_Setup!E47","v":150}]
[{"$f":"_Setup!A47","v":" "},{"$f":"_Setup!B48","v":"Lactate dehydrogenase (LDH)"},null," ",{"$f":"_Setup!C48","v":" u/l "},{"$f":"_Setup!D48","v":100},{"$f":"_Setup!E48","v":190}]
[{"$f":"_Setup!A48","v":"Markers"},{"$f":"_Setup!B49","v":"Beta-2 Microglobulin (B2M)"},null," ",{"$f":"_Setup!C49","v":"g/ml"},{"$f":"_Setup!D49","v":0.01},{"$f":"_Setup!E49","v":2.5}]
[{"$f":"_Setup!A49","v":" "},{"$f":"_Setup!B50","v":"Uric acid"},null," ",{"$f":"_Setup!C50","v":"mg/dL"},{"$f":"_Setup!D50","v":2.5},{"$f":"_Setup!E50","v":8}]
[{"$f":"_Setup!A50","v":" "},{"$f":"_Setup!B51","v":"Urine Albumin /  Albumin/Creatinine Ratio"},null," ",{"$f":"_Setup!C51","v":0},{"$f":"_Setup!D51","v":0},{"$f":"_Setup!E51","v":0}]
[{"$f":"_Setup!A51","v":"Custom"},{"$f":"_Setup!B52","v":"eGFR"},null," ",{"$f":"_Setup!C52","v":"mL/min/1.73m"},{"$f":"_Setup!D52","v":60},{"$f":"_Setup!E52","v":100}]
[{"$f":"_Setup!A52","v":" "},{"$f":"_Setup!B53","v":"cystatin C "},null," ",{"$f":"_Setup!C53","v":0},{"$f":"_Setup!D53","v":0},{"$f":"_Setup!E53","v":0}]
[{"$f":"_Setup!A53","v":" "},{"$f":"_Setup!B54","v":"Custom 4"},null," ",{"$f":"_Setup!C54","v":0},{"$f":"_Setup!D54","v":0},{"$f":"_Setup!E54","v":0}]
[{"$f":"_Setup!A54","v":" "},{"$f":"_Setup!B55","v":"Custom 5"},null," ",{"$f":"_Setup!C55","v":0},{"$f":"_Setup!D55","v":0},{"$f":"_Setup!E55","v":0}]

{"sheet":"_8","index":24,"n_rows":53,"n_cols":7,"rows_kept":53,"cut":false,"hidden":false,"merged":[]}
[null,"Date",null,"Lab 1","Lab 2","Lab 3","Lab 4"]
[null,null,null,"Lab 5","Lab 6","Lab 7","Lab 8"]
["Lab Setup","Lab Measures",null,"Lab 9","Lab 10","Lab 11","Lab 12"]
["Lab Report","Lab Plot"]
["TYPE","TEST NAME","RESULT","H/L","UNITS","L","H"]
[{"$f":"_Setup!A8","v":"Complete Metabolic Profile"},{"$f":"_Setup!B8","v":"ALP (Alkaline Phosphatase)"},66,{"$f":"IF(ISBLANK(C6),\" \",IF(C6<F6,\"L\",IF(C6>G6,\"H\",\" \")))","v":" "},{"$f":"_Setup!C8","v":"IU/L"},{"$f":"_Setup!D8","v":30},{"$f":"_Setup!E8","v":130}]
[{"$f":"_Setup!A9","v":" "},{"$f":"_Setup!B9","v":"ALT (amino alanine transferase)"},null,{"$f":"IF(ISBLANK(C7),\" \",IF(C7<F7,\"L\",IF(C7>G7,\"H\",\" \")))","v":" "},{"$f":"_Setup!C9","v":"IU/L"},{"$f":"_Setup!D9","v":5},{"$f":"_Setup!E9","v":40}]
[{"$f":"_Setup!A10","v":" "},{"$f":"_Setup!B10","v":"AST (aspartate aminotransferase)"},null," ",{"$f":"_Setup!C10","v":"IU/L"},{"$f":"_Setup!D10","v":10},{"$f":"_Setup!E10","v":45}]
[{"$f":"_Setup!A11","v":" "},{"$f":"_Setup!B11","v":"Albumin, serum (Alb)"},null," ",{"$f":"_Setup!C11","v":"gm/dL "},{"$f":"_Setup!D11","v":3.5},{"$f":"_Setup!E11","v":5}]
[{"$f":"_Setup!A12","v":" "},{"$f":"_Setup!B12","v":"Bilirubin, Total (Bili), serum"},null," ",{"$f":"_Setup!C12","v":"mg/dL"},{"$f":"_Setup!D12","v":0.2},{"$f":"_Setup!E12","v":1}]
[{"$f":"_Setup!A13","v":" "},{"$f":"_Setup!B13","v":"BUN (Blood urea nitrogen)"},25,"H",{"$f":"_Setup!C13","v":"mg/dL"},{"$f":"_Setup!D13","v":8},{"$f":"_Setup!E13","v":18}]
[{"$f":"_Setup!A14","v":" "},{"$f":"_Setup!B14","v":"Ca - Calcium"},null," ",{"$f":"_Setup!C14","v":"mg/dL"},{"$f":"_Setup!D14","v":8.5},{"$f":"_Setup!E14","v":10.5}]
[{"$f":"_Setup!A15","v":" "},{"$f":"_Setup!B15","v":"CI - Chloride"},null," ",{"$f":"_Setup!C15","v":"mEq/L"},{"$f":"_Setup!D15","v":97},{"$f":"_Setup!E15","v":107}]
[{"$f":"_Setup!A16","v":" "},{"$f":"_Setup!B16","v":"CO2 - Carbon dioxide"},null," ",{"$f":"_Setup!C16","v":"mEq/L"},{"$f":"_Setup!D16","v":20},{"$f":"_Setup!E16","v":29}]
[{"$f":"_Setup!A17","v":" "},{"$f":"_Setup!B17","v":"CRT - Creatinine"},null," ",{"$f":"_Setup!C17","v":"mg/dL"},{"$f":"_Setup!D17","v":0.6},{"$f":"_Setup!E17","v":1.5}]
[{"$f":"_Setup!A18","v":" "},{"$f":"_Setup!B18","v":"Glucose"},null," ",{"$f":"_Setup!C18","v":"mg/dL"},{"$f":"_Setup!D18","v":65},{"$f":"_Setup!E18","v":110}]
[{"$f":"_Setup!A19","v":" "},{"$f":"_Setup!B19","v":"Mg - Magnesium"},null," ",{"$f":"_Setup!C19","v":"mg/dL"},{"$f":"_Setup!D19","v":1.8},{"$f":"_Setup!E19","v":2.5}]
[{"$f":"_Setup!A20","v":" "},{"$f":"_Setup!B20","v":"Potassium (K)"},null," ",{"$f":"_Setup!C20","v":"mEq/L"},{"$f":"_Setup!D20","v":3.5},{"$f":"_Setup!E20","v":5}]
[{"$f":"_Setup!A21","v":" "},{"$f":"_Setup!B21","v":"Sodium (Na)"},null," ",{"$f":"_Setup!C21","v":"mEq/L"},{"$f":"_Setup!D21","v":135},{"$f":"_Setup!E21","v":145}]
[{"$f":"_Setup!A22","v":" "},{"$f":"_Setup!B22","v":"Total Protein"},null," ",{"$f":"_Setup!C22","v":"gm/dL "},{"$f":"_Setup!D22","v":6},{"$f":"_Setup!E22","v":8}]
[{"$f":"_Setup!A23","v":"CBC"},{"$f":"_Setup!B23","v":"RBC - Red Blood Cells"},null," ",{"$f":"_Setup!C23","v":"(X106/uL)"},{"$f":"_Setup!D23","v":4.4000000000000004},{"$f":"_Setup!E23","v":5.6}]
[{"$f":"_Setup!A24","v":" "},{"$f":"_Setup!B24","v":"Hgb - Hemoglobin"},null," ",{"$f":"_Setup!C24","v":"(g/dL)"},{"$f":"_Setup!D24","v":13},{"$f":"_Setup!E24","v":18}]
[{"$f":"_Setup!A25","v":" "},{"$f":"_Setup!B25","v":"Hct - Hematocrtit"},null," ",{"$f":"_Setup!C25","v":"%"},{"$f":"_Setup!D25","v":0.38},{"$f":"_Setup!E25","v":0.5}]
[{"$f":"_Setup!A26","v":" "},{"$f":"_Setup!B26","v":"MCV - Mean Corp. Volume"},null," ",{"$f":"_Setup!C26","v":"(fL)"},{"$f":"_Setup!D26","v":81},{"$f":"_Setup!E26","v":98}]
[{"$f":"_Setup!A27","v":" "},{"$f":"_Setup!B27","v":"MCH - Mean Corp. Hgb"},null," ",{"$f":"_Setup!C27","v":"(pg)"},{"$f":"_Setup!D27","v":27.3},{"$f":"_Setup!E27","v":33.6}]
[{"$f":"_Setup!A28","v":" "},{"$f":"_Setup!B28","v":"MCHC - Mean Corp. Hgb Concentration"},null," ",{"$f":"_Setup!C28","v":"(g/dL)"},{"$f":"_Setup!D28","v":32.299999999999997},{"$f":"_Setup!E28","v":35.700000000000003}]
[{"$f":"_Setup!A29","v":" "},{"$f":"_Setup!B29","v":"RDW - Red cell Dist Width"},null," ",{"$f":"_Setup!C29","v":"%"},{"$f":"_Setup!D29","v":0.11799999999999999},{"$f":"_Setup!E29","v":0.14099999999999999}]
[{"$f":"_Setup!A30","v":" "},{"$f":"_Setup!B30","v":"ESR - Erythrocyte Sedimentation Rate"},null," ",{"$f":"_Setup!C30","v":"mm/hr"},{"$f":"_Setup!D30","v":0.01},{"$f":"_Setup!E30","v":20}]
[{"$f":"_Setup!A31","v":" "},{"$f":"_Setup!B31","v":"Platelets (Thrombocytes)"},null," ",{"$f":"_Setup!C31","v":"(X103/uL)"},{"$f":"_Setup!D31","v":150},{"$f":"_Setup!E31","v":400}]
[{"$f":"_Setup!A31","v":" "},{"$f":"_Setup!B32","v":"WBC - White blood cells"},null," ",{"$f":"_Setup!C32","v":"(X103/uL)"},{"$f":"_Setup!D32","v":4.3},{"$f":"_Setup!E32","v":10}]
[{"$f":"_Setup!A32","v":" "},{"$f":"_Setup!B33","v":"Basophils"},null,{"$f":"IF(ISBLANK(C31),\" \",IF(C31<F31,\"L\",IF(C31>G31,\"H\",\" \")))","v":" "},{"$f":"_Setup!C33","v":"(X103/uL)"},{"$f":"_Setup!D33","v":0.01},{"$f":"_Setup!E33","v":0.2}]
[{"$f":"_Setup!A33","v":" "},{"$f":"_Setup!B34","v":"Eosinophils"},null,{"$f":"IF(ISBLANK(C32),\" \",IF(C32<F32,\"L\",IF(C32>G32,\"H\",\" \")))","v":" "},{"$f":"_Setup!C34","v":"(X103/uL)"},{"$f":"_Setup!D34","v":0.01},{"$f":"_Setup!E34","v":0.5}]
[{"$f":"_Setup!A34","v":" "},{"$f":"_Setup!B35","v":"Monocytes"},null," ",{"$f":"_Setup!C35","v":"(X103/uL)"},{"$f":"_Setup!D35","v":0.01},{"$f":"_Setup!E35","v":0.8}]
[{"$f":"_Setup!A35","v":" "},{"$f":"_Setup!B36","v":"Total Neutrophils"},null," ",{"$f":"_Setup!C36","v":"%"},{"$f":"_Setup!D36","v":38},{"$f":"_Setup!E36","v":80}]
[{"$f":"_Setup!A36","v":"Differential"},{"$f":"_Setup!B37","v":"Total Neutrophils, Absolute (ANC)"},null," ",{"$f":"_Setup!C37","v":"Cells/Cu.Mm"},{"$f":"_Setup!D37","v":1650},{"$f":"_Setup!E37","v":8000}]
[{"$f":"_Setup!A37","v":" "},{"$f":"_Setup!B38","v":"Total Lymphocytes"},null," ",{"$f":"_Setup!C38","v":"%"},{"$f":"_Setup!D38","v":15},{"$f":"_Setup!E38","v":49}]
[{"$f":"_Setup!A38","v":" "},{"$f":"_Setup!B39","v":"Total Lymphocytes, Absolute"},null," ",{"$f":"_Setup!C39","v":"Cells/Cu.Mm"},{"$f":"_Setup!D39","v":1000},{"$f":"_Setup!E39","v":3500}]
[{"$f":"_Setup!A39","v":" "},{"$f":"_Setup!B40","v":"Monocytes"},null," ",{"$f":"_Setup!C40","v":"%"},{"$f":"_Setup!D40","v":0.01},{"$f":"_Setup!E40","v":13}]
[{"$f":"_Setup!A40","v":" "},{"$f":"_Setup!B41","v":"Monocytes, Absolute "},null," ",{"$f":"_Setup!C41","v":"Cells/Cu.Mm"},{"$f":"_Setup!D41","v":40},{"$f":"_Setup!E41","v":900}]
[{"$f":"_Setup!A41","v":" "},{"$f":"_Setup!B42","v":"Basophils"},null," ",{"$f":"_Setup!C42","v":"%"},{"$f":"_Setup!D42","v":0.01},{"$f":"_Setup!E42","v":2}]
[{"$f":"_Setup!A42","v":" "},{"$f":"_Setup!B43","v":"Basophils, Absolute"},null," ",{"$f":"_Setup!C43","v":"Cells/Cu.Mm"},{"$f":"_Setup!D43","v":0.01},{"$f":"_Setup!E43","v":125}]
[{"$f":"_Setup!A43","v":" "},{"$f":"_Setup!B44","v":"Eosinophils"},null," ",{"$f":"_Setup!C44","v":"%"},{"$f":"_Setup!D44","v":0.01},{"$f":"_Setup!E44","v":8}]
[{"$f":"_Setup!A44","v":" "},{"$f":"_Setup!B45","v":"Eosinophils, Absolute"},null," ",{"$f":"_Setup!C45","v":"Cells/Cu.Mm"},{"$f":"_Setup!D45","v":30},{"$f":"_Setup!E45","v":600}]
[{"$f":"_Setup!A45","v":" "},{"$f":"_Setup!B46","v":"Cholesterol, total"},null," ",{"$f":"_Setup!C46","v":"mg/dL"},{"$f":"_Setup!D46","v":130},{"$f":"_Setup!E46","v":200}]
[{"$f":"_Setup!A46","v":"Lipids"},{"$f":"_Setup!B47","v":"Triglycerides"},null," ",{"$f":"_Setup!C47","v":"mg/dL"},{"$f":"_Setup!D47","v":10},{"$f":"_Setup!E47","v":150}]
[{"$f":"_Setup!A47","v":" "},{"$f":"_Setup!B48","v":"Lactate dehydrogenase (LDH)"},null," ",{"$f":"_Setup!C48","v":" u/l "},{"$f":"_Setup!D48","v":100},{"$f":"_Setup!E48","v":190}]
[{"$f":"_Setup!A48","v":"Markers"},{"$f":"_Setup!B49","v":"Beta-2 Microglobulin (B2M)"},null," ",{"$f":"_Setup!C49","v":"g/ml"},{"$f":"_Setup!D49","v":0.01},{"$f":"_Setup!E49","v":2.5}]
[{"$f":"_Setup!A49","v":" "},{"$f":"_Setup!B50","v":"Uric acid"},null," ",{"$f":"_Setup!C50","v":"mg/dL"},{"$f":"_Setup!D50","v":2.5},{"$f":"_Setup!E50","v":8}]
[{"$f":"_Setup!A50","v":" "},{"$f":"_Setup!B51","v":"Urine Albumin /  Albumin/Creatinine Ratio"},null," ",{"$f":"_Setup!C51","v":0},{"$f":"_Setup!D51","v":0},{"$f":"_Setup!E51","v":0}]
[{"$f":"_Setup!A51","v":"Custom"},{"$f":"_Setup!B52","v":"eGFR"},null," ",{"$f":"_Setup!C52","v":"mL/min/1.73m"},{"$f":"_Setup!D52","v":60},{"$f":"_Setup!E52","v":100}]
[{"$f":"_Setup!A52","v":" "},{"$f":"_Setup!B53","v":"cystatin C "},null," ",{"$f":"_Setup!C53","v":0},{"$f":"_Setup!D53","v":0},{"$f":"_Setup!E53","v":0}]
[{"$f":"_Setup!A53","v":" "},{"$f":"_Setup!B54","v":"Custom 4"},null," ",{"$f":"_Setup!C54","v":0},{"$f":"_Setup!D54","v":0},{"$f":"_Setup!E54","v":0}]
[{"$f":"_Setup!A54","v":" "},{"$f":"_Setup!B55","v":"Custom 5"},null," ",{"$f":"_Setup!C55","v":0},{"$f":"_Setup!D55","v":0},{"$f":"_Setup!E55","v":0}]

{"sheet":"_9","index":25,"n_rows":53,"n_cols":7,"rows_kept":53,"cut":false,"hidden":false,"merged":[]}
[null,"Date",null,"Lab 1","Lab 2","Lab 3","Lab 4"]
[null,null,null,"Lab 5","Lab 6","Lab 7","Lab 8"]
["Lab Setup","Lab Measures",null,"Lab 9","Lab 10","Lab 11","Lab 12"]
["Lab Report","Lab Plot"]
["TYPE","TEST NAME","RESULT","H/L","UNITS","L","H"]
[{"$f":"_Setup!A8","v":"Complete Metabolic Profile"},{"$f":"_Setup!B8","v":"ALP (Alkaline Phosphatase)"},88,{"$f":"IF(ISBLANK(C6),\" \",IF(C6<F6,\"L\",IF(C6>G6,\"H\",\" \")))","v":" "},{"$f":"_Setup!C8","v":"IU/L"},{"$f":"_Setup!D8","v":30},{"$f":"_Setup!E8","v":130}]
[{"$f":"_Setup!A9","v":" "},{"$f":"_Setup!B9","v":"ALT (amino alanine transferase)"},null,{"$f":"IF(ISBLANK(C7),\" \",IF(C7<F7,\"L\",IF(C7>G7,\"H\",\" \")))","v":" "},{"$f":"_Setup!C9","v":"IU/L"},{"$f":"_Setup!D9","v":5},{"$f":"_Setup!E9","v":40}]
[{"$f":"_Setup!A10","v":" "},{"$f":"_Setup!B10","v":"AST (aspartate aminotransferase)"},null," ",{"$f":"_Setup!C10","v":"IU/L"},{"$f":"_Setup!D10","v":10},{"$f":"_Setup!E10","v":45}]
[{"$f":"_Setup!A11","v":" "},{"$f":"_Setup!B11","v":"Albumin, serum (Alb)"},null," ",{"$f":"_Setup!C11","v":"gm/dL "},{"$f":"_Setup!D11","v":3.5},{"$f":"_Setup!E11","v":5}]
[{"$f":"_Setup!A12","v":" "},{"$f":"_Setup!B12","v":"Bilirubin, Total (Bili), serum"},null," ",{"$f":"_Setup!C12","v":"mg/dL"},{"$f":"_Setup!D12","v":0.2},{"$f":"_Setup!E12","v":1}]
[{"$f":"_Setup!A13","v":" "},{"$f":"_Setup!B13","v":"BUN (Blood urea nitrogen)"},33,"H",{"$f":"_Setup!C13","v":"mg/dL"},{"$f":"_Setup!D13","v":8},{"$f":"_Setup!E13","v":18}]
[{"$f":"_Setup!A14","v":" "},{"$f":"_Setup!B14","v":"Ca - Calcium"},null," ",{"$f":"_Setup!C14","v":"mg/dL"},{"$f":"_Setup!D14","v":8.5},{"$f":"_Setup!E14","v":10.5}]
[{"$f":"_Setup!A15","v":" "},{"$f":"_Setup!B15","v":"CI - Chloride"},null," ",{"$f":"_Setup!C15","v":"mEq/L"},{"$f":"_Setup!D15","v":97},{"$f":"_Setup!E15","v":107}]
[{"$f":"_Setup!A16","v":" "},{"$f":"_Setup!B16","v":"CO2 - Carbon dioxide"},null," ",{"$f":"_Setup!C16","v":"mEq/L"},{"$f":"_Setup!D16","v":20},{"$f":"_Setup!E16","v":29}]
[{"$f":"_Setup!A17","v":" "},{"$f":"_Setup!B17","v":"CRT - Creatinine"},null," ",{"$f":"_Setup!C17","v":"mg/dL"},{"$f":"_Setup!D17","v":0.6},{"$f":"_Setup!E17","v":1.5}]
[{"$f":"_Setup!A18","v":" "},{"$f":"_Setup!B18","v":"Glucose"},null," ",{"$f":"_Setup!C18","v":"mg/dL"},{"$f":"_Setup!D18","v":65},{"$f":"_Setup!E18","v":110}]
[{"$f":"_Setup!A19","v":" "},{"$f":"_Setup!B19","v":"Mg - Magnesium"},null," ",{"$f":"_Setup!C19","v":"mg/dL"},{"$f":"_Setup!D19","v":1.8},{"$f":"_Setup!E19","v":2.5}]
[{"$f":"_Setup!A20","v":" "},{"$f":"_Setup!B20","v":"Potassium (K)"},null," ",{"$f":"_Setup!C20","v":"mEq/L"},{"$f":"_Setup!D20","v":3.5},{"$f":"_Setup!E20","v":5}]
[{"$f":"_Setup!A21","v":" "},{"$f":"_Setup!B21","v":"Sodium (Na)"},null," ",{"$f":"_Setup!C21","v":"mEq/L"},{"$f":"_Setup!D21","v":135},{"$f":"_Setup!E21","v":145}]
[{"$f":"_Setup!A22","v":" "},{"$f":"_Setup!B22","v":"Total Protein"},null," ",{"$f":"_Setup!C22","v":"gm/dL "},{"$f":"_Setup!D22","v":6},{"$f":"_Setup!E22","v":8}]
[{"$f":"_Setup!A23","v":"CBC"},{"$f":"_Setup!B23","v":"RBC - Red Blood Cells"},null," ",{"$f":"_Setup!C23","v":"(X106/uL)"},{"$f":"_Setup!D23","v":4.4000000000000004},{"$f":"_Setup!E23","v":5.6}]
[{"$f":"_Setup!A24","v":" "},{"$f":"_Setup!B24","v":"Hgb - Hemoglobin"},null," ",{"$f":"_Setup!C24","v":"(g/dL)"},{"$f":"_Setup!D24","v":13},{"$f":"_Setup!E24","v":18}]
[{"$f":"_Setup!A25","v":" "},{"$f":"_Setup!B25","v":"Hct - Hematocrtit"},null," ",{"$f":"_Setup!C25","v":"%"},{"$f":"_Setup!D25","v":0.38},{"$f":"_Setup!E25","v":0.5}]
[{"$f":"_Setup!A26","v":" "},{"$f":"_Setup!B26","v":"MCV - Mean Corp. Volume"},null," ",{"$f":"_Setup!C26","v":"(fL)"},{"$f":"_Setup!D26","v":81},{"$f":"_Setup!E26","v":98}]
[{"$f":"_Setup!A27","v":" "},{"$f":"_Setup!B27","v":"MCH - Mean Corp. Hgb"},null," ",{"$f":"_Setup!C27","v":"(pg)"},{"$f":"_Setup!D27","v":27.3},{"$f":"_Setup!E27","v":33.6}]
[{"$f":"_Setup!A28","v":" "},{"$f":"_Setup!B28","v":"MCHC - Mean Corp. Hgb Concentration"},null," ",{"$f":"_Setup!C28","v":"(g/dL)"},{"$f":"_Setup!D28","v":32.299999999999997},{"$f":"_Setup!E28","v":35.700000000000003}]
[{"$f":"_Setup!A29","v":" "},{"$f":"_Setup!B29","v":"RDW - Red cell Dist Width"},null," ",{"$f":"_Setup!C29","v":"%"},{"$f":"_Setup!D29","v":0.11799999999999999},{"$f":"_Setup!E29","v":0.14099999999999999}]
[{"$f":"_Setup!A30","v":" "},{"$f":"_Setup!B30","v":"ESR - Erythrocyte Sedimentation Rate"},null," ",{"$f":"_Setup!C30","v":"mm/hr"},{"$f":"_Setup!D30","v":0.01},{"$f":"_Setup!E30","v":20}]
[{"$f":"_Setup!A31","v":" "},{"$f":"_Setup!B31","v":"Platelets (Thrombocytes)"},null," ",{"$f":"_Setup!C31","v":"(X103/uL)"},{"$f":"_Setup!D31","v":150},{"$f":"_Setup!E31","v":400}]
[{"$f":"_Setup!A31","v":" "},{"$f":"_Setup!B32","v":"WBC - White blood cells"},null," ",{"$f":"_Setup!C32","v":"(X103/uL)"},{"$f":"_Setup!D32","v":4.3},{"$f":"_Setup!E32","v":10}]
[{"$f":"_Setup!A32","v":" "},{"$f":"_Setup!B33","v":"Basophils"},null,{"$f":"IF(ISBLANK(C31),\" \",IF(C31<F31,\"L\",IF(C31>G31,\"H\",\" \")))","v":" "},{"$f":"_Setup!C33","v":"(X103/uL)"},{"$f":"_Setup!D33","v":0.01},{"$f":"_Setup!E33","v":0.2}]
[{"$f":"_Setup!A33","v":" "},{"$f":"_Setup!B34","v":"Eosinophils"},null,{"$f":"IF(ISBLANK(C32),\" \",IF(C32<F32,\"L\",IF(C32>G32,\"H\",\" \")))","v":" "},{"$f":"_Setup!C34","v":"(X103/uL)"},{"$f":"_Setup!D34","v":0.01},{"$f":"_Setup!E34","v":0.5}]
[{"$f":"_Setup!A34","v":" "},{"$f":"_Setup!B35","v":"Monocytes"},null," ",{"$f":"_Setup!C35","v":"(X103/uL)"},{"$f":"_Setup!D35","v":0.01},{"$f":"_Setup!E35","v":0.8}]
[{"$f":"_Setup!A35","v":" "},{"$f":"_Setup!B36","v":"Total Neutrophils"},null," ",{"$f":"_Setup!C36","v":"%"},{"$f":"_Setup!D36","v":38},{"$f":"_Setup!E36","v":80}]
[{"$f":"_Setup!A36","v":"Differential"},{"$f":"_Setup!B37","v":"Total Neutrophils, Absolute (ANC)"},null," ",{"$f":"_Setup!C37","v":"Cells/Cu.Mm"},{"$f":"_Setup!D37","v":1650},{"$f":"_Setup!E37","v":8000}]
[{"$f":"_Setup!A37","v":" "},{"$f":"_Setup!B38","v":"Total Lymphocytes"},null," ",{"$f":"_Setup!C38","v":"%"},{"$f":"_Setup!D38","v":15},{"$f":"_Setup!E38","v":49}]
[{"$f":"_Setup!A38","v":" "},{"$f":"_Setup!B39","v":"Total Lymphocytes, Absolute"},null," ",{"$f":"_Setup!C39","v":"Cells/Cu.Mm"},{"$f":"_Setup!D39","v":1000},{"$f":"_Setup!E39","v":3500}]
[{"$f":"_Setup!A39","v":" "},{"$f":"_Setup!B40","v":"Monocytes"},null," ",{"$f":"_Setup!C40","v":"%"},{"$f":"_Setup!D40","v":0.01},{"$f":"_Setup!E40","v":13}]
[{"$f":"_Setup!A40","v":" "},{"$f":"_Setup!B41","v":"Monocytes, Absolute "},null," ",{"$f":"_Setup!C41","v":"Cells/Cu.Mm"},{"$f":"_Setup!D41","v":40},{"$f":"_Setup!E41","v":900}]
[{"$f":"_Setup!A41","v":" "},{"$f":"_Setup!B42","v":"Basophils"},null," ",{"$f":"_Setup!C42","v":"%"},{"$f":"_Setup!D42","v":0.01},{"$f":"_Setup!E42","v":2}]
[{"$f":"_Setup!A42","v":" "},{"$f":"_Setup!B43","v":"Basophils, Absolute"},null," ",{"$f":"_Setup!C43","v":"Cells/Cu.Mm"},{"$f":"_Setup!D43","v":0.01},{"$f":"_Setup!E43","v":125}]
[{"$f":"_Setup!A43","v":" "},{"$f":"_Setup!B44","v":"Eosinophils"},null," ",{"$f":"_Setup!C44","v":"%"},{"$f":"_Setup!D44","v":0.01},{"$f":"_Setup!E44","v":8}]
[{"$f":"_Setup!A44","v":" "},{"$f":"_Setup!B45","v":"Eosinophils, Absolute"},null," ",{"$f":"_Setup!C45","v":"Cells/Cu.Mm"},{"$f":"_Setup!D45","v":30},{"$f":"_Setup!E45","v":600}]
[{"$f":"_Setup!A45","v":" "},{"$f":"_Setup!B46","v":"Cholesterol, total"},null," ",{"$f":"_Setup!C46","v":"mg/dL"},{"$f":"_Setup!D46","v":130},{"$f":"_Setup!E46","v":200}]
[{"$f":"_Setup!A46","v":"Lipids"},{"$f":"_Setup!B47","v":"Triglycerides"},null," ",{"$f":"_Setup!C47","v":"mg/dL"},{"$f":"_Setup!D47","v":10},{"$f":"_Setup!E47","v":150}]
[{"$f":"_Setup!A47","v":" "},{"$f":"_Setup!B48","v":"Lactate dehydrogenase (LDH)"},null," ",{"$f":"_Setup!C48","v":" u/l "},{"$f":"_Setup!D48","v":100},{"$f":"_Setup!E48","v":190}]
[{"$f":"_Setup!A48","v":"Markers"},{"$f":"_Setup!B49","v":"Beta-2 Microglobulin (B2M)"},null," ",{"$f":"_Setup!C49","v":"g/ml"},{"$f":"_Setup!D49","v":0.01},{"$f":"_Setup!E49","v":2.5}]
[{"$f":"_Setup!A49","v":" "},{"$f":"_Setup!B50","v":"Uric acid"},null," ",{"$f":"_Setup!C50","v":"mg/dL"},{"$f":"_Setup!D50","v":2.5},{"$f":"_Setup!E50","v":8}]
[{"$f":"_Setup!A50","v":" "},{"$f":"_Setup!B51","v":"Urine Albumin /  Albumin/Creatinine Ratio"},null," ",{"$f":"_Setup!C51","v":0},{"$f":"_Setup!D51","v":0},{"$f":"_Setup!E51","v":0}]
[{"$f":"_Setup!A51","v":"Custom"},{"$f":"_Setup!B52","v":"eGFR"},null," ",{"$f":"_Setup!C52","v":"mL/min/1.73m"},{"$f":"_Setup!D52","v":60},{"$f":"_Setup!E52","v":100}]
[{"$f":"_Setup!A52","v":" "},{"$f":"_Setup!B53","v":"cystatin C "},null," ",{"$f":"_Setup!C53","v":0},{"$f":"_Setup!D53","v":0},{"$f":"_Setup!E53","v":0}]
[{"$f":"_Setup!A53","v":" "},{"$f":"_Setup!B54","v":"Custom 4"},null," ",{"$f":"_Setup!C54","v":0},{"$f":"_Setup!D54","v":0},{"$f":"_Setup!E54","v":0}]
[{"$f":"_Setup!A54","v":" "},{"$f":"_Setup!B55","v":"Custom 5"},null," ",{"$f":"_Setup!C55","v":0},{"$f":"_Setup!D55","v":0},{"$f":"_Setup!E55","v":0}]

{"sheet":"_10","index":26,"n_rows":53,"n_cols":7,"rows_kept":53,"cut":false,"hidden":false,"merged":[]}
[null,"Date",null,"Lab 1","Lab 2","Lab 3","Lab 4"]
[null,null,null,"Lab 5","Lab 6","Lab 7","Lab 8"]
["Lab Setup","Lab Measures",null,"Lab 9","Lab 10","Lab 11","Lab 12"]
["Lab Report","Lab Plot"]
["TYPE","TEST NAME","RESULT","H/L","UNITS","L","H"]
[{"$f":"_Setup!A8","v":"Complete Metabolic Profile"},{"$f":"_Setup!B8","v":"ALP (Alkaline Phosphatase)"},150,{"$f":"IF(ISBLANK(C6),\" \",IF(C6<F6,\"L\",IF(C6>G6,\"H\",\" \")))","v":"H"},{"$f":"_Setup!C8","v":"IU/L"},{"$f":"_Setup!D8","v":30},{"$f":"_Setup!E8","v":130}]
[{"$f":"_Setup!A9","v":" "},{"$f":"_Setup!B9","v":"ALT (amino alanine transferase)"},null,{"$f":"IF(ISBLANK(C7),\" \",IF(C7<F7,\"L\",IF(C7>G7,\"H\",\" \")))","v":" "},{"$f":"_Setup!C9","v":"IU/L"},{"$f":"_Setup!D9","v":5},{"$f":"_Setup!E9","v":40}]
[{"$f":"_Setup!A10","v":" "},{"$f":"_Setup!B10","v":"AST (aspartate aminotransferase)"},null," ",{"$f":"_Setup!C10","v":"IU/L"},{"$f":"_Setup!D10","v":10},{"$f":"_Setup!E10","v":45}]
[{"$f":"_Setup!A11","v":" "},{"$f":"_Setup!B11","v":"Albumin, serum (Alb)"},null," ",{"$f":"_Setup!C11","v":"gm/dL "},{"$f":"_Setup!D11","v":3.5},{"$f":"_Setup!E11","v":5}]
[{"$f":"_Setup!A12","v":" "},{"$f":"_Setup!B12","v":"Bilirubin, Total (Bili), serum"},null," ",{"$f":"_Setup!C12","v":"mg/dL"},{"$f":"_Setup!D12","v":0.2},{"$f":"_Setup!E12","v":1}]
[{"$f":"_Setup!A13","v":" "},{"$f":"_Setup!B13","v":"BUN (Blood urea nitrogen)"},33,"H",{"$f":"_Setup!C13","v":"mg/dL"},{"$f":"_Setup!D13","v":8},{"$f":"_Setup!E13","v":18}]
[{"$f":"_Setup!A14","v":" "},{"$f":"_Setup!B14","v":"Ca - Calcium"},null," ",{"$f":"_Setup!C14","v":"mg/dL"},{"$f":"_Setup!D14","v":8.5},{"$f":"_Setup!E14","v":10.5}]
[{"$f":"_Setup!A15","v":" "},{"$f":"_Setup!B15","v":"CI - Chloride"},null," ",{"$f":"_Setup!C15","v":"mEq/L"},{"$f":"_Setup!D15","v":97},{"$f":"_Setup!E15","v":107}]
[{"$f":"_Setup!A16","v":" "},{"$f":"_Setup!B16","v":"CO2 - Carbon dioxide"},null," ",{"$f":"_Setup!C16","v":"mEq/L"},{"$f":"_Setup!D16","v":20},{"$f":"_Setup!E16","v":29}]
[{"$f":"_Setup!A17","v":" "},{"$f":"_Setup!B17","v":"CRT - Creatinine"},null," ",{"$f":"_Setup!C17","v":"mg/dL"},{"$f":"_Setup!D17","v":0.6},{"$f":"_Setup!E17","v":1.5}]
[{"$f":"_Setup!A18","v":" "},{"$f":"_Setup!B18","v":"Glucose"},null," ",{"$f":"_Setup!C18","v":"mg/dL"},{"$f":"_Setup!D18","v":65},{"$f":"_Setup!E18","v":110}]
[{"$f":"_Setup!A19","v":" "},{"$f":"_Setup!B19","v":"Mg - Magnesium"},null," ",{"$f":"_Setup!C19","v":"mg/dL"},{"$f":"_Setup!D19","v":1.8},{"$f":"_Setup!E19","v":2.5}]
[{"$f":"_Setup!A20","v":" "},{"$f":"_Setup!B20","v":"Potassium (K)"},null," ",{"$f":"_Setup!C20","v":"mEq/L"},{"$f":"_Setup!D20","v":3.5},{"$f":"_Setup!E20","v":5}]
[{"$f":"_Setup!A21","v":" "},{"$f":"_Setup!B21","v":"Sodium (Na)"},null," ",{"$f":"_Setup!C21","v":"mEq/L"},{"$f":"_Setup!D21","v":135},{"$f":"_Setup!E21","v":145}]
[{"$f":"_Setup!A22","v":" "},{"$f":"_Setup!B22","v":"Total Protein"},null," ",{"$f":"_Setup!C22","v":"gm/dL "},{"$f":"_Setup!D22","v":6},{"$f":"_Setup!E22","v":8}]
[{"$f":"_Setup!A23","v":"CBC"},{"$f":"_Setup!B23","v":"RBC - Red Blood Cells"},null," ",{"$f":"_Setup!C23","v":"(X106/uL)"},{"$f":"_Setup!D23","v":4.4000000000000004},{"$f":"_Setup!E23","v":5.6}]
[{"$f":"_Setup!A24","v":" "},{"$f":"_Setup!B24","v":"Hgb - Hemoglobin"},null," ",{"$f":"_Setup!C24","v":"(g/dL)"},{"$f":"_Setup!D24","v":13},{"$f":"_Setup!E24","v":18}]
[{"$f":"_Setup!A25","v":" "},{"$f":"_Setup!B25","v":"Hct - Hematocrtit"},null," ",{"$f":"_Setup!C25","v":"%"},{"$f":"_Setup!D25","v":0.38},{"$f":"_Setup!E25","v":0.5}]
[{"$f":"_Setup!A26","v":" "},{"$f":"_Setup!B26","v":"MCV - Mean Corp. Volume"},null," ",{"$f":"_Setup!C26","v":"(fL)"},{"$f":"_Setup!D26","v":81},{"$f":"_Setup!E26","v":98}]
[{"$f":"_Setup!A27","v":" "},{"$f":"_Setup!B27","v":"MCH - Mean Corp. Hgb"},null," ",{"$f":"_Setup!C27","v":"(pg)"},{"$f":"_Setup!D27","v":27.3},{"$f":"_Setup!E27","v":33.6}]
[{"$f":"_Setup!A28","v":" "},{"$f":"_Setup!B28","v":"MCHC - Mean Corp. Hgb Concentration"},null," ",{"$f":"_Setup!C28","v":"(g/dL)"},{"$f":"_Setup!D28","v":32.299999999999997},{"$f":"_Setup!E28","v":35.700000000000003}]
[{"$f":"_Setup!A29","v":" "},{"$f":"_Setup!B29","v":"RDW - Red cell Dist Width"},null," ",{"$f":"_Setup!C29","v":"%"},{"$f":"_Setup!D29","v":0.11799999999999999},{"$f":"_Setup!E29","v":0.14099999999999999}]
[{"$f":"_Setup!A30","v":" "},{"$f":"_Setup!B30","v":"ESR - Erythrocyte Sedimentation Rate"},null," ",{"$f":"_Setup!C30","v":"mm/hr"},{"$f":"_Setup!D30","v":0.01},{"$f":"_Setup!E30","v":20}]
[{"$f":"_Setup!A31","v":" "},{"$f":"_Setup!B31","v":"Platelets (Thrombocytes)"},null," ",{"$f":"_Setup!C31","v":"(X103/uL)"},{"$f":"_Setup!D31","v":150},{"$f":"_Setup!E31","v":400}]
[{"$f":"_Setup!A31","v":" "},{"$f":"_Setup!B32","v":"WBC - White blood cells"},null," ",{"$f":"_Setup!C32","v":"(X103/uL)"},{"$f":"_Setup!D32","v":4.3},{"$f":"_Setup!E32","v":10}]
[{"$f":"_Setup!A32","v":" "},{"$f":"_Setup!B33","v":"Basophils"},null,{"$f":"IF(ISBLANK(C31),\" \",IF(C31<F31,\"L\",IF(C31>G31,\"H\",\" \")))","v":" "},{"$f":"_Setup!C33","v":"(X103/uL)"},{"$f":"_Setup!D33","v":0.01},{"$f":"_Setup!E33","v":0.2}]
[{"$f":"_Setup!A33","v":" "},{"$f":"_Setup!B34","v":"Eosinophils"},null,{"$f":"IF(ISBLANK(C32),\" \",IF(C32<F32,\"L\",IF(C32>G32,\"H\",\" \")))","v":" "},{"$f":"_Setup!C34","v":"(X103/uL)"},{"$f":"_Setup!D34","v":0.01},{"$f":"_Setup!E34","v":0.5}]
[{"$f":"_Setup!A34","v":" "},{"$f":"_Setup!B35","v":"Monocytes"},null," ",{"$f":"_Setup!C35","v":"(X103/uL)"},{"$f":"_Setup!D35","v":0.01},{"$f":"_Setup!E35","v":0.8}]
[{"$f":"_Setup!A35","v":" "},{"$f":"_Setup!B36","v":"Total Neutrophils"},null," ",{"$f":"_Setup!C36","v":"%"},{"$f":"_Setup!D36","v":38},{"$f":"_Setup!E36","v":80}]
[{"$f":"_Setup!A36","v":"Differential"},{"$f":"_Setup!B37","v":"Total Neutrophils, Absolute (ANC)"},null," ",{"$f":"_Setup!C37","v":"Cells/Cu.Mm"},{"$f":"_Setup!D37","v":1650},{"$f":"_Setup!E37","v":8000}]
[{"$f":"_Setup!A37","v":" "},{"$f":"_Setup!B38","v":"Total Lymphocytes"},null," ",{"$f":"_Setup!C38","v":"%"},{"$f":"_Setup!D38","v":15},{"$f":"_Setup!E38","v":49}]
[{"$f":"_Setup!A38","v":" "},{"$f":"_Setup!B39","v":"Total Lymphocytes, Absolute"},null," ",{"$f":"_Setup!C39","v":"Cells/Cu.Mm"},{"$f":"_Setup!D39","v":1000},{"$f":"_Setup!E39","v":3500}]
[{"$f":"_Setup!A39","v":" "},{"$f":"_Setup!B40","v":"Monocytes"},null," ",{"$f":"_Setup!C40","v":"%"},{"$f":"_Setup!D40","v":0.01},{"$f":"_Setup!E40","v":13}]
[{"$f":"_Setup!A40","v":" "},{"$f":"_Setup!B41","v":"Monocytes, Absolute "},null," ",{"$f":"_Setup!C41","v":"Cells/Cu.Mm"},{"$f":"_Setup!D41","v":40},{"$f":"_Setup!E41","v":900}]
[{"$f":"_Setup!A41","v":" "},{"$f":"_Setup!B42","v":"Basophils"},null," ",{"$f":"_Setup!C42","v":"%"},{"$f":"_Setup!D42","v":0.01},{"$f":"_Setup!E42","v":2}]
[{"$f":"_Setup!A42","v":" "},{"$f":"_Setup!B43","v":"Basophils, Absolute"},null," ",{"$f":"_Setup!C43","v":"Cells/Cu.Mm"},{"$f":"_Setup!D43","v":0.01},{"$f":"_Setup!E43","v":125}]
[{"$f":"_Setup!A43","v":" "},{"$f":"_Setup!B44","v":"Eosinophils"},null," ",{"$f":"_Setup!C44","v":"%"},{"$f":"_Setup!D44","v":0.01},{"$f":"_Setup!E44","v":8}]
[{"$f":"_Setup!A44","v":" "},{"$f":"_Setup!B45","v":"Eosinophils, Absolute"},null," ",{"$f":"_Setup!C45","v":"Cells/Cu.Mm"},{"$f":"_Setup!D45","v":30},{"$f":"_Setup!E45","v":600}]
[{"$f":"_Setup!A45","v":" "},{"$f":"_Setup!B46","v":"Cholesterol, total"},null," ",{"$f":"_Setup!C46","v":"mg/dL"},{"$f":"_Setup!D46","v":130},{"$f":"_Setup!E46","v":200}]
[{"$f":"_Setup!A46","v":"Lipids"},{"$f":"_Setup!B47","v":"Triglycerides"},null," ",{"$f":"_Setup!C47","v":"mg/dL"},{"$f":"_Setup!D47","v":10},{"$f":"_Setup!E47","v":150}]
[{"$f":"_Setup!A47","v":" "},{"$f":"_Setup!B48","v":"Lactate dehydrogenase (LDH)"},null," ",{"$f":"_Setup!C48","v":" u/l "},{"$f":"_Setup!D48","v":100},{"$f":"_Setup!E48","v":190}]
[{"$f":"_Setup!A48","v":"Markers"},{"$f":"_Setup!B49","v":"Beta-2 Microglobulin (B2M)"},null," ",{"$f":"_Setup!C49","v":"g/ml"},{"$f":"_Setup!D49","v":0.01},{"$f":"_Setup!E49","v":2.5}]
[{"$f":"_Setup!A49","v":" "},{"$f":"_Setup!B50","v":"Uric acid"},null," ",{"$f":"_Setup!C50","v":"mg/dL"},{"$f":"_Setup!D50","v":2.5},{"$f":"_Setup!E50","v":8}]
[{"$f":"_Setup!A50","v":" "},{"$f":"_Setup!B51","v":"Urine Albumin /  Albumin/Creatinine Ratio"},null," ",{"$f":"_Setup!C51","v":0},{"$f":"_Setup!D51","v":0},{"$f":"_Setup!E51","v":0}]
[{"$f":"_Setup!A51","v":"Custom"},{"$f":"_Setup!B52","v":"eGFR"},null," ",{"$f":"_Setup!C52","v":"mL/min/1.73m"},{"$f":"_Setup!D52","v":60},{"$f":"_Setup!E52","v":100}]
[{"$f":"_Setup!A52","v":" "},{"$f":"_Setup!B53","v":"cystatin C "},null," ",{"$f":"_Setup!C53","v":0},{"$f":"_Setup!D53","v":0},{"$f":"_Setup!E53","v":0}]
[{"$f":"_Setup!A53","v":" "},{"$f":"_Setup!B54","v":"Custom 4"},null," ",{"$f":"_Setup!C54","v":0},{"$f":"_Setup!D54","v":0},{"$f":"_Setup!E54","v":0}]
[{"$f":"_Setup!A54","v":" "},{"$f":"_Setup!B55","v":"Custom 5"},null," ",{"$f":"_Setup!C55","v":0},{"$f":"_Setup!D55","v":0},{"$f":"_Setup!E55","v":0}]

{"sheet":"_11","index":27,"n_rows":53,"n_cols":7,"rows_kept":53,"cut":false,"hidden":false,"merged":[]}
[null,"Date",null,"Lab 1","Lab 2","Lab 3","Lab 4"]
[null,null,null,"Lab 5","Lab 6","Lab 7","Lab 8"]
["Lab Setup","Lab Measures",null,"Lab 9","Lab 10","Lab 11","Lab 12"]
["Lab Report","Lab Plot"]
["TYPE","TEST NAME","RESULT","H/L","UNITS","L","H"]
[{"$f":"_Setup!A8","v":"Complete Metabolic Profile"},{"$f":"_Setup!B8","v":"ALP (Alkaline Phosphatase)"},170,{"$f":"IF(ISBLANK(C6),\" \",IF(C6<F6,\"L\",IF(C6>G6,\"H\",\" \")))","v":"H"},{"$f":"_Setup!C8","v":"IU/L"},{"$f":"_Setup!D8","v":30},{"$f":"_Setup!E8","v":130}]
[{"$f":"_Setup!A9","v":" "},{"$f":"_Setup!B9","v":"ALT (amino alanine transferase)"},null,{"$f":"IF(ISBLANK(C7),\" \",IF(C7<F7,\"L\",IF(C7>G7,\"H\",\" \")))","v":" "},{"$f":"_Setup!C9","v":"IU/L"},{"$f":"_Setup!D9","v":5},{"$f":"_Setup!E9","v":40}]
[{"$f":"_Setup!A10","v":" "},{"$f":"_Setup!B10","v":"AST (aspartate aminotransferase)"},null," ",{"$f":"_Setup!C10","v":"IU/L"},{"$f":"_Setup!D10","v":10},{"$f":"_Setup!E10","v":45}]
[{"$f":"_Setup!A11","v":" "},{"$f":"_Setup!B11","v":"Albumin, serum (Alb)"},null," ",{"$f":"_Setup!C11","v":"gm/dL "},{"$f":"_Setup!D11","v":3.5},{"$f":"_Setup!E11","v":5}]
[{"$f":"_Setup!A12","v":" "},{"$f":"_Setup!B12","v":"Bilirubin, Total (Bili), serum"},null," ",{"$f":"_Setup!C12","v":"mg/dL"},{"$f":"_Setup!D12","v":0.2},{"$f":"_Setup!E12","v":1}]
[{"$f":"_Setup!A13","v":" "},{"$f":"_Setup!B13","v":"BUN (Blood urea nitrogen)"},37,"H",{"$f":"_Setup!C13","v":"mg/dL"},{"$f":"_Setup!D13","v":8},{"$f":"_Setup!E13","v":18}]
[{"$f":"_Setup!A14","v":" "},{"$f":"_Setup!B14","v":"Ca - Calcium"},null," ",{"$f":"_Setup!C14","v":"mg/dL"},{"$f":"_Setup!D14","v":8.5},{"$f":"_Setup!E14","v":10.5}]
[{"$f":"_Setup!A15","v":" "},{"$f":"_Setup!B15","v":"CI - Chloride"},null," ",{"$f":"_Setup!C15","v":"mEq/L"},{"$f":"_Setup!D15","v":97},{"$f":"_Setup!E15","v":107}]
[{"$f":"_Setup!A16","v":" "},{"$f":"_Setup!B16","v":"CO2 - Carbon dioxide"},null," ",{"$f":"_Setup!C16","v":"mEq/L"},{"$f":"_Setup!D16","v":20},{"$f":"_Setup!E16","v":29}]
[{"$f":"_Setup!A17","v":" "},{"$f":"_Setup!B17","v":"CRT - Creatinine"},null," ",{"$f":"_Setup!C17","v":"mg/dL"},{"$f":"_Setup!D17","v":0.6},{"$f":"_Setup!E17","v":1.5}]
[{"$f":"_Setup!A18","v":" "},{"$f":"_Setup!B18","v":"Glucose"},null," ",{"$f":"_Setup!C18","v":"mg/dL"},{"$f":"_Setup!D18","v":65},{"$f":"_Setup!E18","v":110}]
[{"$f":"_Setup!A19","v":" "},{"$f":"_Setup!B19","v":"Mg - Magnesium"},null," ",{"$f":"_Setup!C19","v":"mg/dL"},{"$f":"_Setup!D19","v":1.8},{"$f":"_Setup!E19","v":2.5}]
[{"$f":"_Setup!A20","v":" "},{"$f":"_Setup!B20","v":"Potassium (K)"},null," ",{"$f":"_Setup!C20","v":"mEq/L"},{"$f":"_Setup!D20","v":3.5},{"$f":"_Setup!E20","v":5}]
[{"$f":"_Setup!A21","v":" "},{"$f":"_Setup!B21","v":"Sodium (Na)"},null," ",{"$f":"_Setup!C21","v":"mEq/L"},{"$f":"_Setup!D21","v":135},{"$f":"_Setup!E21","v":145}]
[{"$f":"_Setup!A22","v":" "},{"$f":"_Setup!B22","v":"Total Protein"},null," ",{"$f":"_Setup!C22","v":"gm/dL "},{"$f":"_Setup!D22","v":6},{"$f":"_Setup!E22","v":8}]
[{"$f":"_Setup!A23","v":"CBC"},{"$f":"_Setup!B23","v":"RBC - Red Blood Cells"},null," ",{"$f":"_Setup!C23","v":"(X106/uL)"},{"$f":"_Setup!D23","v":4.4000000000000004},{"$f":"_Setup!E23","v":5.6}]
[{"$f":"_Setup!A24","v":" "},{"$f":"_Setup!B24","v":"Hgb - Hemoglobin"},null," ",{"$f":"_Setup!C24","v":"(g/dL)"},{"$f":"_Setup!D24","v":13},{"$f":"_Setup!E24","v":18}]
[{"$f":"_Setup!A25","v":" "},{"$f":"_Setup!B25","v":"Hct - Hematocrtit"},null," ",{"$f":"_Setup!C25","v":"%"},{"$f":"_Setup!D25","v":0.38},{"$f":"_Setup!E25","v":0.5}]
[{"$f":"_Setup!A26","v":" "},{"$f":"_Setup!B26","v":"MCV - Mean Corp. Volume"},null," ",{"$f":"_Setup!C26","v":"(fL)"},{"$f":"_Setup!D26","v":81},{"$f":"_Setup!E26","v":98}]
[{"$f":"_Setup!A27","v":" "},{"$f":"_Setup!B27","v":"MCH - Mean Corp. Hgb"},null," ",{"$f":"_Setup!C27","v":"(pg)"},{"$f":"_Setup!D27","v":27.3},{"$f":"_Setup!E27","v":33.6}]
[{"$f":"_Setup!A28","v":" "},{"$f":"_Setup!B28","v":"MCHC - Mean Corp. Hgb Concentration"},null," ",{"$f":"_Setup!C28","v":"(g/dL)"},{"$f":"_Setup!D28","v":32.299999999999997},{"$f":"_Setup!E28","v":35.700000000000003}]
[{"$f":"_Setup!A29","v":" "},{"$f":"_Setup!B29","v":"RDW - Red cell Dist Width"},null," ",{"$f":"_Setup!C29","v":"%"},{"$f":"_Setup!D29","v":0.11799999999999999},{"$f":"_Setup!E29","v":0.14099999999999999}]
[{"$f":"_Setup!A30","v":" "},{"$f":"_Setup!B30","v":"ESR - Erythrocyte Sedimentation Rate"},null," ",{"$f":"_Setup!C30","v":"mm/hr"},{"$f":"_Setup!D30","v":0.01},{"$f":"_Setup!E30","v":20}]
[{"$f":"_Setup!A31","v":" "},{"$f":"_Setup!B31","v":"Platelets (Thrombocytes)"},null," ",{"$f":"_Setup!C31","v":"(X103/uL)"},{"$f":"_Setup!D31","v":150},{"$f":"_Setup!E31","v":400}]
[{"$f":"_Setup!A31","v":" "},{"$f":"_Setup!B32","v":"WBC - White blood cells"},null," ",{"$f":"_Setup!C32","v":"(X103/uL)"},{"$f":"_Setup!D32","v":4.3},{"$f":"_Setup!E32","v":10}]
[{"$f":"_Setup!A32","v":" "},{"$f":"_Setup!B33","v":"Basophils"},null,{"$f":"IF(ISBLANK(C31),\" \",IF(C31<F31,\"L\",IF(C31>G31,\"H\",\" \")))","v":" "},{"$f":"_Setup!C33","v":"(X103/uL)"},{"$f":"_Setup!D33","v":0.01},{"$f":"_Setup!E33","v":0.2}]
[{"$f":"_Setup!A33","v":" "},{"$f":"_Setup!B34","v":"Eosinophils"},null,{"$f":"IF(ISBLANK(C32),\" \",IF(C32<F32,\"L\",IF(C32>G32,\"H\",\" \")))","v":" "},{"$f":"_Setup!C34","v":"(X103/uL)"},{"$f":"_Setup!D34","v":0.01},{"$f":"_Setup!E34","v":0.5}]
[{"$f":"_Setup!A34","v":" "},{"$f":"_Setup!B35","v":"Monocytes"},null," ",{"$f":"_Setup!C35","v":"(X103/uL)"},{"$f":"_Setup!D35","v":0.01},{"$f":"_Setup!E35","v":0.8}]
[{"$f":"_Setup!A35","v":" "},{"$f":"_Setup!B36","v":"Total Neutrophils"},null," ",{"$f":"_Setup!C36","v":"%"},{"$f":"_Setup!D36","v":38},{"$f":"_Setup!E36","v":80}]
[{"$f":"_Setup!A36","v":"Differential"},{"$f":"_Setup!B37","v":"Total Neutrophils, Absolute (ANC)"},null," ",{"$f":"_Setup!C37","v":"Cells/Cu.Mm"},{"$f":"_Setup!D37","v":1650},{"$f":"_Setup!E37","v":8000}]
[{"$f":"_Setup!A37","v":" "},{"$f":"_Setup!B38","v":"Total Lymphocytes"},null," ",{"$f":"_Setup!C38","v":"%"},{"$f":"_Setup!D38","v":15},{"$f":"_Setup!E38","v":49}]
[{"$f":"_Setup!A38","v":" "},{"$f":"_Setup!B39","v":"Total Lymphocytes, Absolute"},null," ",{"$f":"_Setup!C39","v":"Cells/Cu.Mm"},{"$f":"_Setup!D39","v":1000},{"$f":"_Setup!E39","v":3500}]
[{"$f":"_Setup!A39","v":" "},{"$f":"_Setup!B40","v":"Monocytes"},null," ",{"$f":"_Setup!C40","v":"%"},{"$f":"_Setup!D40","v":0.01},{"$f":"_Setup!E40","v":13}]
[{"$f":"_Setup!A40","v":" "},{"$f":"_Setup!B41","v":"Monocytes, Absolute "},null," ",{"$f":"_Setup!C41","v":"Cells/Cu.Mm"},{"$f":"_Setup!D41","v":40},{"$f":"_Setup!E41","v":900}]
[{"$f":"_Setup!A41","v":" "},{"$f":"_Setup!B42","v":"Basophils"},null," ",{"$f":"_Setup!C42","v":"%"},{"$f":"_Setup!D42","v":0.01},{"$f":"_Setup!E42","v":2}]
[{"$f":"_Setup!A42","v":" "},{"$f":"_Setup!B43","v":"Basophils, Absolute"},null," ",{"$f":"_Setup!C43","v":"Cells/Cu.Mm"},{"$f":"_Setup!D43","v":0.01},{"$f":"_Setup!E43","v":125}]
[{"$f":"_Setup!A43","v":" "},{"$f":"_Setup!B44","v":"Eosinophils"},null," ",{"$f":"_Setup!C44","v":"%"},{"$f":"_Setup!D44","v":0.01},{"$f":"_Setup!E44","v":8}]
[{"$f":"_Setup!A44","v":" "},{"$f":"_Setup!B45","v":"Eosinophils, Absolute"},null," ",{"$f":"_Setup!C45","v":"Cells/Cu.Mm"},{"$f":"_Setup!D45","v":30},{"$f":"_Setup!E45","v":600}]
[{"$f":"_Setup!A45","v":" "},{"$f":"_Setup!B46","v":"Cholesterol, total"},null," ",{"$f":"_Setup!C46","v":"mg/dL"},{"$f":"_Setup!D46","v":130},{"$f":"_Setup!E46","v":200}]
[{"$f":"_Setup!A46","v":"Lipids"},{"$f":"_Setup!B47","v":"Triglycerides"},null," ",{"$f":"_Setup!C47","v":"mg/dL"},{"$f":"_Setup!D47","v":10},{"$f":"_Setup!E47","v":150}]
[{"$f":"_Setup!A47","v":" "},{"$f":"_Setup!B48","v":"Lactate dehydrogenase (LDH)"},null," ",{"$f":"_Setup!C48","v":" u/l "},{"$f":"_Setup!D48","v":100},{"$f":"_Setup!E48","v":190}]
[{"$f":"_Setup!A48","v":"Markers"},{"$f":"_Setup!B49","v":"Beta-2 Microglobulin (B2M)"},null," ",{"$f":"_Setup!C49","v":"g/ml"},{"$f":"_Setup!D49","v":0.01},{"$f":"_Setup!E49","v":2.5}]
[{"$f":"_Setup!A49","v":" "},{"$f":"_Setup!B50","v":"Uric acid"},null," ",{"$f":"_Setup!C50","v":"mg/dL"},{"$f":"_Setup!D50","v":2.5},{"$f":"_Setup!E50","v":8}]
[{"$f":"_Setup!A50","v":" "},{"$f":"_Setup!B51","v":"Urine Albumin /  Albumin/Creatinine Ratio"},null," ",{"$f":"_Setup!C51","v":0},{"$f":"_Setup!D51","v":0},{"$f":"_Setup!E51","v":0}]
[{"$f":"_Setup!A51","v":"Custom"},{"$f":"_Setup!B52","v":"eGFR"},null," ",{"$f":"_Setup!C52","v":"mL/min/1.73m"},{"$f":"_Setup!D52","v":60},{"$f":"_Setup!E52","v":100}]
[{"$f":"_Setup!A52","v":" "},{"$f":"_Setup!B53","v":"cystatin C "},null," ",{"$f":"_Setup!C53","v":0},{"$f":"_Setup!D53","v":0},{"$f":"_Setup!E53","v":0}]
[{"$f":"_Setup!A53","v":" "},{"$f":"_Setup!B54","v":"Custom 4"},null," ",{"$f":"_Setup!C54","v":0},{"$f":"_Setup!D54","v":0},{"$f":"_Setup!E54","v":0}]
[{"$f":"_Setup!A54","v":" "},{"$f":"_Setup!B55","v":"Custom 5"},null," ",{"$f":"_Setup!C55","v":0},{"$f":"_Setup!D55","v":0},{"$f":"_Setup!E55","v":0}]

{"sheet":"_12","index":28,"n_rows":53,"n_cols":7,"rows_kept":53,"cut":false,"hidden":false,"merged":[]}
[null,"Date",null,"Lab 1","Lab 2","Lab 3","Lab 4"]
[null,null,null,"Lab 5","Lab 6","Lab 7","Lab 8"]
["Lab Setup","Lab Measures",null,"Lab 9","Lab 10","Lab 11","Lab 12"]
["Lab Report","Lab Plot"]
["TYPE","TEST NAME","RESULT","H/L","UNITS","L","H"]
[{"$f":"_Setup!A8","v":"Complete Metabolic Profile"},{"$f":"_Setup!B8","v":"ALP (Alkaline Phosphatase)"},180,{"$f":"IF(ISBLANK(C6),\" \",IF(C6<F6,\"L\",IF(C6>G6,\"H\",\" \")))","v":"H"},{"$f":"_Setup!C8","v":"IU/L"},{"$f":"_Setup!D8","v":30},{"$f":"_Setup!E8","v":130}]
[{"$f":"_Setup!A9","v":" "},{"$f":"_Setup!B9","v":"ALT (amino alanine transferase)"},null,{"$f":"IF(ISBLANK(C7),\" \",IF(C7<F7,\"L\",IF(C7>G7,\"H\",\" \")))","v":" "},{"$f":"_Setup!C9","v":"IU/L"},{"$f":"_Setup!D9","v":5},{"$f":"_Setup!E9","v":40}]
[{"$f":"_Setup!A10","v":" "},{"$f":"_Setup!B10","v":"AST (aspartate aminotransferase)"},null," ",{"$f":"_Setup!C10","v":"IU/L"},{"$f":"_Setup!D10","v":10},{"$f":"_Setup!E10","v":45}]
[{"$f":"_Setup!A11","v":" "},{"$f":"_Setup!B11","v":"Albumin, serum (Alb)"},null," ",{"$f":"_Setup!C11","v":"gm/dL "},{"$f":"_Setup!D11","v":3.5},{"$f":"_Setup!E11","v":5}]
[{"$f":"_Setup!A12","v":" "},{"$f":"_Setup!B12","v":"Bilirubin, Total (Bili), serum"},null," ",{"$f":"_Setup!C12","v":"mg/dL"},{"$f":"_Setup!D12","v":0.2},{"$f":"_Setup!E12","v":1}]
[{"$f":"_Setup!A13","v":" "},{"$f":"_Setup!B13","v":"BUN (Blood urea nitrogen)"},39,"H",{"$f":"_Setup!C13","v":"mg/dL"},{"$f":"_Setup!D13","v":8},{"$f":"_Setup!E13","v":18}]
[{"$f":"_Setup!A14","v":" "},{"$f":"_Setup!B14","v":"Ca - Calcium"},null," ",{"$f":"_Setup!C14","v":"mg/dL"},{"$f":"_Setup!D14","v":8.5},{"$f":"_Setup!E14","v":10.5}]
[{"$f":"_Setup!A15","v":" "},{"$f":"_Setup!B15","v":"CI - Chloride"},null," ",{"$f":"_Setup!C15","v":"mEq/L"},{"$f":"_Setup!D15","v":97},{"$f":"_Setup!E15","v":107}]
[{"$f":"_Setup!A16","v":" "},{"$f":"_Setup!B16","v":"CO2 - Carbon dioxide"},null," ",{"$f":"_Setup!C16","v":"mEq/L"},{"$f":"_Setup!D16","v":20},{"$f":"_Setup!E16","v":29}]
[{"$f":"_Setup!A17","v":" "},{"$f":"_Setup!B17","v":"CRT - Creatinine"},null," ",{"$f":"_Setup!C17","v":"mg/dL"},{"$f":"_Setup!D17","v":0.6},{"$f":"_Setup!E17","v":1.5}]
[{"$f":"_Setup!A18","v":" "},{"$f":"_Setup!B18","v":"Glucose"},null," ",{"$f":"_Setup!C18","v":"mg/dL"},{"$f":"_Setup!D18","v":65},{"$f":"_Setup!E18","v":110}]
[{"$f":"_Setup!A19","v":" "},{"$f":"_Setup!B19","v":"Mg - Magnesium"},null," ",{"$f":"_Setup!C19","v":"mg/dL"},{"$f":"_Setup!D19","v":1.8},{"$f":"_Setup!E19","v":2.5}]
[{"$f":"_Setup!A20","v":" "},{"$f":"_Setup!B20","v":"Potassium (K)"},null," ",{"$f":"_Setup!C20","v":"mEq/L"},{"$f":"_Setup!D20","v":3.5},{"$f":"_Setup!E20","v":5}]
[{"$f":"_Setup!A21","v":" "},{"$f":"_Setup!B21","v":"Sodium (Na)"},null," ",{"$f":"_Setup!C21","v":"mEq/L"},{"$f":"_Setup!D21","v":135},{"$f":"_Setup!E21","v":145}]
[{"$f":"_Setup!A22","v":" "},{"$f":"_Setup!B22","v":"Total Protein"},null," ",{"$f":"_Setup!C22","v":"gm/dL "},{"$f":"_Setup!D22","v":6},{"$f":"_Setup!E22","v":8}]
[{"$f":"_Setup!A23","v":"CBC"},{"$f":"_Setup!B23","v":"RBC - Red Blood Cells"},null," ",{"$f":"_Setup!C23","v":"(X106/uL)"},{"$f":"_Setup!D23","v":4.4000000000000004},{"$f":"_Setup!E23","v":5.6}]
[{"$f":"_Setup!A24","v":" "},{"$f":"_Setup!B24","v":"Hgb - Hemoglobin"},null," ",{"$f":"_Setup!C24","v":"(g/dL)"},{"$f":"_Setup!D24","v":13},{"$f":"_Setup!E24","v":18}]
[{"$f":"_Setup!A25","v":" "},{"$f":"_Setup!B25","v":"Hct - Hematocrtit"},null," ",{"$f":"_Setup!C25","v":"%"},{"$f":"_Setup!D25","v":0.38},{"$f":"_Setup!E25","v":0.5}]
[{"$f":"_Setup!A26","v":" "},{"$f":"_Setup!B26","v":"MCV - Mean Corp. Volume"},null," ",{"$f":"_Setup!C26","v":"(fL)"},{"$f":"_Setup!D26","v":81},{"$f":"_Setup!E26","v":98}]
[{"$f":"_Setup!A27","v":" "},{"$f":"_Setup!B27","v":"MCH - Mean Corp. Hgb"},null," ",{"$f":"_Setup!C27","v":"(pg)"},{"$f":"_Setup!D27","v":27.3},{"$f":"_Setup!E27","v":33.6}]
[{"$f":"_Setup!A28","v":" "},{"$f":"_Setup!B28","v":"MCHC - Mean Corp. Hgb Concentration"},null," ",{"$f":"_Setup!C28","v":"(g/dL)"},{"$f":"_Setup!D28","v":32.299999999999997},{"$f":"_Setup!E28","v":35.700000000000003}]
[{"$f":"_Setup!A29","v":" "},{"$f":"_Setup!B29","v":"RDW - Red cell Dist Width"},null," ",{"$f":"_Setup!C29","v":"%"},{"$f":"_Setup!D29","v":0.11799999999999999},{"$f":"_Setup!E29","v":0.14099999999999999}]
[{"$f":"_Setup!A30","v":" "},{"$f":"_Setup!B30","v":"ESR - Erythrocyte Sedimentation Rate"},null," ",{"$f":"_Setup!C30","v":"mm/hr"},{"$f":"_Setup!D30","v":0.01},{"$f":"_Setup!E30","v":20}]
[{"$f":"_Setup!A31","v":" "},{"$f":"_Setup!B31","v":"Platelets (Thrombocytes)"},null," ",{"$f":"_Setup!C31","v":"(X103/uL)"},{"$f":"_Setup!D31","v":150},{"$f":"_Setup!E31","v":400}]
[{"$f":"_Setup!A31","v":" "},{"$f":"_Setup!B32","v":"WBC - White blood cells"},null," ",{"$f":"_Setup!C32","v":"(X103/uL)"},{"$f":"_Setup!D32","v":4.3},{"$f":"_Setup!E32","v":10}]
[{"$f":"_Setup!A32","v":" "},{"$f":"_Setup!B33","v":"Basophils"},null,{"$f":"IF(ISBLANK(C31),\" \",IF(C31<F31,\"L\",IF(C31>G31,\"H\",\" \")))","v":" "},{"$f":"_Setup!C33","v":"(X103/uL)"},{"$f":"_Setup!D33","v":0.01},{"$f":"_Setup!E33","v":0.2}]
[{"$f":"_Setup!A33","v":" "},{"$f":"_Setup!B34","v":"Eosinophils"},null,{"$f":"IF(ISBLANK(C32),\" \",IF(C32<F32,\"L\",IF(C32>G32,\"H\",\" \")))","v":" "},{"$f":"_Setup!C34","v":"(X103/uL)"},{"$f":"_Setup!D34","v":0.01},{"$f":"_Setup!E34","v":0.5}]
[{"$f":"_Setup!A34","v":" "},{"$f":"_Setup!B35","v":"Monocytes"},null," ",{"$f":"_Setup!C35","v":"(X103/uL)"},{"$f":"_Setup!D35","v":0.01},{"$f":"_Setup!E35","v":0.8}]
[{"$f":"_Setup!A35","v":" "},{"$f":"_Setup!B36","v":"Total Neutrophils"},null," ",{"$f":"_Setup!C36","v":"%"},{"$f":"_Setup!D36","v":38},{"$f":"_Setup!E36","v":80}]
[{"$f":"_Setup!A36","v":"Differential"},{"$f":"_Setup!B37","v":"Total Neutrophils, Absolute (ANC)"},null," ",{"$f":"_Setup!C37","v":"Cells/Cu.Mm"},{"$f":"_Setup!D37","v":1650},{"$f":"_Setup!E37","v":8000}]
[{"$f":"_Setup!A37","v":" "},{"$f":"_Setup!B38","v":"Total Lymphocytes"},null," ",{"$f":"_Setup!C38","v":"%"},{"$f":"_Setup!D38","v":15},{"$f":"_Setup!E38","v":49}]
[{"$f":"_Setup!A38","v":" "},{"$f":"_Setup!B39","v":"Total Lymphocytes, Absolute"},null," ",{"$f":"_Setup!C39","v":"Cells/Cu.Mm"},{"$f":"_Setup!D39","v":1000},{"$f":"_Setup!E39","v":3500}]
[{"$f":"_Setup!A39","v":" "},{"$f":"_Setup!B40","v":"Monocytes"},null," ",{"$f":"_Setup!C40","v":"%"},{"$f":"_Setup!D40","v":0.01},{"$f":"_Setup!E40","v":13}]
[{"$f":"_Setup!A40","v":" "},{"$f":"_Setup!B41","v":"Monocytes, Absolute "},null," ",{"$f":"_Setup!C41","v":"Cells/Cu.Mm"},{"$f":"_Setup!D41","v":40},{"$f":"_Setup!E41","v":900}]
[{"$f":"_Setup!A41","v":" "},{"$f":"_Setup!B42","v":"Basophils"},null," ",{"$f":"_Setup!C42","v":"%"},{"$f":"_Setup!D42","v":0.01},{"$f":"_Setup!E42","v":2}]
[{"$f":"_Setup!A42","v":" "},{"$f":"_Setup!B43","v":"Basophils, Absolute"},null," ",{"$f":"_Setup!C43","v":"Cells/Cu.Mm"},{"$f":"_Setup!D43","v":0.01},{"$f":"_Setup!E43","v":125}]
[{"$f":"_Setup!A43","v":" "},{"$f":"_Setup!B44","v":"Eosinophils"},null," ",{"$f":"_Setup!C44","v":"%"},{"$f":"_Setup!D44","v":0.01},{"$f":"_Setup!E44","v":8}]
[{"$f":"_Setup!A44","v":" "},{"$f":"_Setup!B45","v":"Eosinophils, Absolute"},null," ",{"$f":"_Setup!C45","v":"Cells/Cu.Mm"},{"$f":"_Setup!D45","v":30},{"$f":"_Setup!E45","v":600}]
[{"$f":"_Setup!A45","v":" "},{"$f":"_Setup!B46","v":"Cholesterol, total"},null," ",{"$f":"_Setup!C46","v":"mg/dL"},{"$f":"_Setup!D46","v":130},{"$f":"_Setup!E46","v":200}]
[{"$f":"_Setup!A46","v":"Lipids"},{"$f":"_Setup!B47","v":"Triglycerides"},null," ",{"$f":"_Setup!C47","v":"mg/dL"},{"$f":"_Setup!D47","v":10},{"$f":"_Setup!E47","v":150}]
[{"$f":"_Setup!A47","v":" "},{"$f":"_Setup!B48","v":"Lactate dehydrogenase (LDH)"},null," ",{"$f":"_Setup!C48","v":" u/l "},{"$f":"_Setup!D48","v":100},{"$f":"_Setup!E48","v":190}]
[{"$f":"_Setup!A48","v":"Markers"},{"$f":"_Setup!B49","v":"Beta-2 Microglobulin (B2M)"},null," ",{"$f":"_Setup!C49","v":"g/ml"},{"$f":"_Setup!D49","v":0.01},{"$f":"_Setup!E49","v":2.5}]
[{"$f":"_Setup!A49","v":" "},{"$f":"_Setup!B50","v":"Uric acid"},null," ",{"$f":"_Setup!C50","v":"mg/dL"},{"$f":"_Setup!D50","v":2.5},{"$f":"_Setup!E50","v":8}]
[{"$f":"_Setup!A50","v":" "},{"$f":"_Setup!B51","v":"Urine Albumin /  Albumin/Creatinine Ratio"},null," ",{"$f":"_Setup!C51","v":0},{"$f":"_Setup!D51","v":0},{"$f":"_Setup!E51","v":0}]
[{"$f":"_Setup!A51","v":"Custom"},{"$f":"_Setup!B52","v":"eGFR"},null," ",{"$f":"_Setup!C52","v":"mL/min/1.73m"},{"$f":"_Setup!D52","v":60},{"$f":"_Setup!E52","v":100}]
[{"$f":"_Setup!A52","v":" "},{"$f":"_Setup!B53","v":"cystatin C "},null," ",{"$f":"_Setup!C53","v":0},{"$f":"_Setup!D53","v":0},{"$f":"_Setup!E53","v":0}]
[{"$f":"_Setup!A53","v":" "},{"$f":"_Setup!B54","v":"Custom 4"},null," ",{"$f":"_Setup!C54","v":0},{"$f":"_Setup!D54","v":0},{"$f":"_Setup!E54","v":0}]
[{"$f":"_Setup!A54","v":" "},{"$f":"_Setup!B55","v":"Custom 5"},null," ",{"$f":"_Setup!C55","v":0},{"$f":"_Setup!D55","v":0},{"$f":"_Setup!E55","v":0}]

{"sheet":"Measures","index":29,"n_rows":10,"n_cols":3,"rows_kept":10,"cut":false,"hidden":false,"merged":[[2,1,2,2]]}
[]
[]
["Lab Setup","LAB UNITS"]
[]
[null,"Abbrev","Meaning"]
[null,"mEq/L ","milliequivalent per liter"]
[null,"mg/dL","milligrams per deciliter"]
[null,"pg/cell","picograms per cell "]
[null,"mm/hr.","millimeters per hour"]
[null,"fL","femtoliter"]